CGI/Perl Guide | Learning Center | Forums | Advertise | Login
Site Search: in

  Main Index MAIN
INDEX
Search Posts SEARCH
POSTS
Who's Online WHO'S
ONLINE
Log in LOG
IN

Home: Perl Programming Help: Beginner:
Automatic reply to email

 

First page Previous page 1 2 Next page Last page  View All


zak100
User

Nov 11, 2014, 10:28 AM

Post #1 of 44 (18317 views)
Automatic reply to email Can't Post

Hi,
Can somebody guide me how to know about the arrival of email using gmail smtp? I got a code for sending email using gmail smtp from this web site which is given below:

Code
#!/usr/bin/perl 
use strict;
use warnings;
use Email::Send;
use Email::Send::Gmail;
use Email::Simple::Creator;
use RPC::XML::Server;
use RPC::XML::Client;







use IO::Socket::SSL qw( SSL_VERIFY_NONE );
my ($uri);

my $cli=RPC::XML::Client->new($uri,
useragent => [
ssl_opts => {
verify_hostname => 0,
SSL_verify_mode => SSL_VERIFY_NONE,
},
],
);

my $email = Email::Simple->create(
header => [
From => 'zulfi60001@gmail.com',
To => 'zulfi60001@gmail.com',
Subject => 'Server down',
],
body => 'The server is down. Start panicing.',
);

my $sender = Email::Send->new(
{ mailer => 'Gmail',
mailer_args => [
username => 'zulfi60001@gmail.com',
password => 'testing',
]
}
);
eval { $sender->send($email) };
die "Error sending email: $@" if $@;


Somebody please help me in this regard.

Zulfi.


zak100
User

Nov 18, 2014, 10:22 AM

Post #2 of 44 (18139 views)
Re: [zak100] Automatic reply to email [In reply to] Can't Post

Hi,
I got gmail norifier code. Some body please guide me how to use it. I want to use it for getting automatic alerts about the arrival of any email on my gmail account & to know about the sender. The code is:

Code
#!/usr/bin/perl 
package GmailNotifier;
use Moose;
use AnyEvent;
use AnyEvent::Gmail::Feed;
use Mac::Growl ':all';

with 'MooseX::Getopt';

has 'username' => (is => 'rw', isa => 'Str', required => 1);
has 'password' => (is => 'rw', isa => 'Str', required => 1);
has 'interval' => (is => 'rw', isa => 'Int', default => 60);

sub run {
my ($self, %args) = @_;

my %seen;
RegisterNotifications('GmailNotifier', ['email.arrived'], ['email.arrived']);
AnyEvent::Gmail::Feed->new(
username => $self->username,
password => $self->password,
interval => $self->interval,
on_new_entry => sub {
my $entry = shift;
warn "send notify: " . $entry->summary;
PostNotification('GmailNotifier', 'email.arrived', $entry->title, $entry->summary);
},
);
AnyEvent->condvar->recv;
}


Some body please guide me. I dont know what's the purpose of PostNotification? Where i have to specify my my gmail account's email address.

Zulfi.


(This post was edited by zak100 on Nov 18, 2014, 10:34 AM)


zak100
User

Nov 20, 2014, 10:28 AM

Post #3 of 44 (18045 views)
Re: [zak100] Automatic reply to email [In reply to] Can't Post

Hi,
I got one code using Gmail::Checker?? Is it workable. I am not able to install Gmail::Checker using PPM.

Code
use GMail::Checker; 

my $gwrapper = new GMail::Checker();
my $gwrapper = new GMail::Checker(USERNAME => "username, PASSWORD => "password");

# Let's log into our account (using SSL)
$gwrapper->login("username","password");

# Get the number of messages in the maildrop & their total size
my ($nb, $size) = $gwrapper->get_msg_nb_size();

# Do we have new messages ?
my $alert = $gwrapper->get_pretty_nb_messages(ALERT => "TOTAL_MSG");

# Get the headers for a specific message (defaults to last message)
my @headers = $gwrapper->get_msg_headers(HEADERS => "FULL", MSG => 74);

# Get a message size
my ($msgnb, $msgsize) = $gwrapper->get_msg_size(MSG => 42);

# Retrieve a specific message
my @msg = $gwrapper->get_msg(MSG => 23);

# Retrieve UIDL for a message
my @uidl = $gwrapper->get_uidl(MSG => 10);

GMail checker download problem:

Code
C:\Users\HP>ppm install GMail::Checker 
Installing package 'GMail-Checker'...
Error installing package 'GMail-Checker': Could not locate a PPD file for packag
e GMail-Checker

C:\Users\HP>


Some body please guide me.

Zulfi.


(This post was edited by zak100 on Nov 20, 2014, 10:30 AM)


zak100
User

Nov 21, 2014, 1:05 AM

Post #4 of 44 (18030 views)
Re: [zak100] Automatic reply to email [In reply to] Can't Post

Hi,

I am able to install GMail::Checker but i am getting following error when i am executing my program:


Code
  

C:\Users\Administrator>ppm install GMail::Checker
Downloading GMail-Checker-1.04...done
Unpacking GMail-Checker-1.04...done
Generating HTML for GMail-Checker-1.04...done
Updating files in site area...done
2 files installed

C:\Users\Administrator>ppm install Email::Send





But i am getting following error when i am executing my program:


Code
  


D:\perl program>perl getemails.pl
IO::Socket::INET configuration failed SSL connect attempt failed with unknown er
ror error:14090086:SSL routines:SSL3_GET_SERVER_CERTIFICATE:certificate verify f
ailed at C:/Perl/site/lib/GMail/Checker.pm line 48.

D:\perl program>





My program is :

#!/usr/bin/perl
use GMail::Checker;

my $gwrapper = new GMail::Checker();
my $gwrapper = new GMail::Checker(USERNAME => "$username", PASSWORD => "$password");

# Let's log into our account (using SSL)
$gwrapper->login("zulfi60001@gmail.com","testing");

# Get the number of messages in the maildrop & their total size
my ($nb, $size) = $gwrapper->get_msg_nb_size();

# Do we have new messages ?
my $alert = $gwrapper->get_pretty_nb_messages(ALERT => "TOTAL_MSG");

# Get the headers for a specific message (defaults to last message)
my @headers = $gwrapper->get_msg_headers(HEADERS => "FULL", MSG => 74);

# Get a message size
my ($msgnb, $msgsize) = $gwrapper->get_msg_size(MSG => 42);

# Retrieve a specific message
my @msg = $gwrapper->get_msg(MSG => 23);

# Retrieve UIDL for a message
my @uidl = $gwrapper->get_uidl(MSG => 10);





Some body please guide me.



Zulfi.


pstewart
Novice

Nov 25, 2014, 8:05 AM

Post #5 of 44 (17818 views)
Re: [zak100] Automatic reply to email [In reply to] Can't Post

Haven't you been asking people to do this for you for more than a year now?


zak100
User

Nov 25, 2014, 8:18 AM

Post #6 of 44 (17816 views)
Re: [pstewart] Automatic reply to email [In reply to] Can't Post

Why are you asking this Question?

Zulfi.


pstewart
Novice

Nov 25, 2014, 8:29 AM

Post #7 of 44 (17813 views)
Re: [zak100] Automatic reply to email [In reply to] Can't Post

Why are you not answering it?
http://perlguru.com/gforum.cgi?post=77022;#77022

After an entire year, your not able to get this working? You've spammed two other forums I'm on with this same kind of thing. why can't you seem to understand what people are telling you or read instructions?


zak100
User

Nov 25, 2014, 8:50 AM

Post #8 of 44 (17810 views)
Re: [pstewart] Automatic reply to email [In reply to] Can't Post

Hi,
Okay, if you know this, i would tell you the truth. I told this to other forums also but they failed to guide me.
If you want to refer to code Guru forum, I was not able to understand their reply. I asked them but I didnt get any reply back.

At Linux forum, those guys misguided me. I posted the email code from different sites but they did not tell me whether its my solution or not. Even then these people failed to help me because they were unable to solve my installation problem.

This is the end of the story.

I cant do the installation of AnyEvent::GMail::Feed. On my windows 7 computer, i have installed:
GMail::Checker and i am able to run the following code:


Code
use strict; 
use warnings;
use feature ':5.10';
use GMail::Checker;
my $g = GMail::Checker->new();
$g->login('zulfi60001@gmail.com', 'ddddddddd');
my ($nb, $size) = $g->get_msg_nb_size();
say "You have $nb messages of $size bytes.";

And the output is:

Code
D:\Zulfi\PERL MAIN FOLDER>perl gmailcheck.pl 
*******************************************************************
Using the default of SSL_verify_mode of SSL_VERIFY_NONE for client
is deprecated! Please set SSL_verify_mode to SSL_VERIFY_PEER
together with SSL_ca_file|SSL_ca_path for verification.
If you really don't want to verify the certificate and keep the
connection open to Man-In-The-Middle attacks please set
SSL_verify_mode explicitly to SSL_VERIFY_NONE in your application.
*******************************************************************
at C:/Perl64/site/lib/GMail/Checker.pm line 48.
You have 110 messages of 33532934 bytes.

D:\Zulfi\PERL MAIN FOLDER>

I posted this program also on Linux forum. However i am not able to install GMail::Checker on my Fedora.

Zulfi.


pstewart
Novice

Nov 25, 2014, 9:09 AM

Post #9 of 44 (17802 views)
Re: [zak100] Automatic reply to email [In reply to] Can't Post


Quote
Okay, if you know this, i would tell you the truth. I told this to other forums also but they failed to guide me.

Wrong...they did not do it for you. You've been given lots of advice, but you don't understnad it.

Quote
If you want to refer to code Guru forum, I was not able to understand their reply. I asked them but I didnt get any reply back.

Except for the MANY people who did reply

Quote
At Linux forum, those guys misguided me. I posted the email code from different sites but they did not tell me whether its my solution or not. Even then these people failed to help me because they were unable to solve my installation problem.

Wrong...you were told what to do several times, but didn't do it. You apparently can't admit you don't understand what you're doing, and are trying to pass off code others have written as your own. And you've been doing it for a while now...you say in other forums you're a teacher, and that this is an assignment...if so, you've been working on it for more than a year now.

Quote
I cant do the installation of AnyEvent::GMail::Feed. On my windows 7 computer, i have installed: GMail::Checker and i am able to run the following code:

Because you don't read the instrcutions! How many times do people have to tell you this? There is a README file that comes with the download of AnyEvent::GMail...if you bothered to open it, you'd see how to install it. Have you done that yet, and if not, WHY NOT??


Quote
And the output is:

Code
D:\Zulfi\PERL MAIN FOLDER>perl gmailcheck.pl 
*******************************************************************
Using the default of SSL_verify_mode of SSL_VERIFY_NONE for client
is deprecated! Please set SSL_verify_mode to SSL_VERIFY_PEER
together with SSL_ca_file|SSL_ca_path for verification.
If you really don't want to verify the certificate and keep the
connection open to Man-In-The-Middle attacks please set
SSL_verify_mode explicitly to SSL_VERIFY_NONE in your application.
*******************************************************************
at C:/Perl64/site/lib/GMail/Checker.pm line 48.
You have 110 messages of 33532934 bytes.

D:\Zulfi\PERL MAIN FOLDER>


and that is code that you blatantly copied from others, and it sure seems like you don't understand what you're doing. Can you not understand the error message the program gave you? It tells you how to fix it.

Quote
I posted this program also on Linux forum. However i am not able to install GMail::Checker on my Fedora.

Because you wont read or follow the instructions, and seem to want someone to do it for you. People will help folks who need it, but lazy people need to do something for themselves first.


FishMonger
Veteran / Moderator

Nov 25, 2014, 9:28 AM

Post #10 of 44 (17795 views)
Re: [zak100] Automatic reply to email [In reply to] Can't Post


Quote
i am not able to install GMail::Checker


You should not use that module. It hasn't been updated/maintaned since 2004. Find another module which is still being maintained.

http://search.cpan.org/search?query=GMail%3A%3A*&mode=all


pstewart
Novice

Nov 25, 2014, 9:30 AM

Post #11 of 44 (17793 views)
Re: [FishMonger] Automatic reply to email [In reply to] Can't Post


In Reply To

Quote
i am not able to install GMail::Checker


You should not use that module. It hasn't been updated/maintaned since 2004. Find another module which is still being maintained.

http://search.cpan.org/search?query=GMail%3A%3A*&mode=all


Exactly what hes been told several times on other forums. he wants someone to write his code for him, copies and pastes code from people as-is, then can't even TRY to modify it for hsi own use, and asks others to do it for him.

hes been doing this since 2009 on various forums.


zak100
User

Nov 25, 2014, 10:20 AM

Post #12 of 44 (17778 views)
Re: [pstewart] Automatic reply to email [In reply to] Can't Post

Hi,
Are you from them? You are speaking like them.

It seems you are!


I got some solution from the follwoing site for gmailchecker.pl:

https://communities.vmware.com/message/2444510
It asks to do some installation. I am not confident to do it. I dont know how to download SSL certificate from the vCenter??


About AnyEvent::GMail::Feed, I tried to install again it worked using i option (cant write the exact command because that window is lost).
I am getting circular dependency error:


Code
D:\Zulfi\PERL MAIN FOLDER>cpan i/AnyEvent::GMail::Feed 
# Failed test at t/11-entry.t line 152.
# '<?xml version="1.0" encoding="UTF-8"?>
# <entry xmlns="http://purl.org/atom/ns#"><content xmlns="http://purl.org/atom/n
s#" mode="base64" type="image/gif">VGhpcyBpcyBhIHRlc3QgdGhhdCBzaG91bGQgdXNlIGJhc
2U2NAAu</content><link xmlns="http://purl.org/atom/ns#" xmlns:list="http://www.s
ixapart.com/atom/list#" title="Number Three" rel="service.post" href="http://www
.example.com/atom" type="application/x.atom+xml" list:type="Books" /><subject xm
lns:dc="http://purl.org/dc/elements/1.1/">Weblog</subject><subject xmlns:dc="htt
p://purl.org/dc/elements/1.1/">Tech</subject></entry>'
# doesn't match '(?^:<dc:subject .*>Weblog</dc:subject>)'

# Failed test at t/11-entry.t line 153.
# '<?xml version="1.0" encoding="UTF-8"?>
# <entry xmlns="http://purl.org/atom/ns#"><content xmlns="http://purl.org/atom/n
s#" mode="base64" type="image/gif">VGhpcyBpcyBhIHRlc3QgdGhhdCBzaG91bGQgdXNlIGJhc
2U2NAAu</content><link xmlns="http://purl.org/atom/ns#" xmlns:list="http://www.s
ixapart.com/atom/list#" title="Number Three" rel="service.post" href="http://www
.example.com/atom" type="application/x.atom+xml" list:type="Books" /><subject xm
lns:dc="http://purl.org/dc/elements/1.1/">Weblog</subject><subject xmlns:dc="htt
p://purl.org/dc/elements/1.1/">Tech</subject></entry>'
# doesn't match '(?^:<dc:subject .*>Tech</dc:subject>)'

# Failed test at t/11-entry.t line 157.
# '<?xml version="1.0" encoding="UTF-8"?>
# <entry xmlns="http://purl.org/atom/ns#"><content xmlns="http://purl.org/atom/n
s#" mode="base64" type="image/gif">VGhpcyBpcyBhIHRlc3QgdGhhdCBzaG91bGQgdXNlIGJhc
2U2NAAu</content><link xmlns="http://purl.org/atom/ns#" xmlns:list="http://www.s
ixapart.com/atom/list#" title="Number Three" rel="service.post" href="http://www
.example.com/atom" type="application/x.atom+xml" list:type="Books" /><subject xm
lns:dc="http://purl.org/dc/elements/1.1/">Weblog</subject><subject xmlns:dc="htt
p://purl.org/dc/elements/1.1/">Tech</subject><subject xmlns:dc="http://purl.org/
dc/elements/1.1/">Weblog</subject></entry>'
# doesn't match '(?^:<dc:subject .*>Weblog</dc:subject>)'
# Looks like you failed 6 tests of 71.
t/11-entry.t ..................... Dubious, test returned 6 (wstat 1536, 0x600)
Failed 6/71 subtests
(less 2 skipped subtests: 63 okay)
t/12-feed.t ...................... 9/33 Can't call method "get_global_pos" on an
undefined value at C:/Perl64/site/lib/XML/XPath/Node.pm line 412.
# Looks like you planned 33 tests but ran 29.
# Looks like your test exited with 255 just after 29.
t/12-feed.t ...................... Dubious, test returned 255 (wstat 65280, 0xff
00)
Failed 4/33 subtests
t/13-atom1.t ..................... 1/23
# Failed test 'atom:title'
# at t/13-atom1.t line 13.
# got: undef
# expected: 'dive into mark'

# Failed test 'atom:version based on namespace'
# at t/13-atom1.t line 14.
# got: '0.3'
# expected: '1.0'

# Failed test 'atom:updated'
# at t/13-atom1.t line 15.
# got: undef
# expected: '2005-07-11T12:29:29Z'

# Failed test '2 links'
# at t/13-atom1.t line 18.
# got: '0'
# expected: '2'
Can't call method "rel" on an undefined value at t/13-atom1.t line 53.
# Looks like you planned 23 tests but ran 5.
# Looks like you failed 4 tests of 5 run.
# Looks like your test exited with 255 just after 5.
t/13-atom1.t ..................... Dubious, test returned 255 (wstat 65280, 0xff
00)
Failed 22/23 subtests
t/14-atom1-create.t .............. ok
t/15-content-image.t ............. ok
t/16-content-binary.t ............ ok
t/17-renames.t ................... 1/5 Can't call method "modified" on an undefi
ned value at t/17-renames.t line 11.
# Looks like you planned 5 tests but ran 1.
# Looks like your test exited with 255 just after 1.
t/17-renames.t ................... Dubious, test returned 255 (wstat 65280, 0xff
00)
Failed 4/5 subtests
t/18-unicode.t ................... skipped: Skipping Unicode test since it depen
ds on LibXML
t/19-ext.t ....................... 1/16
# Failed test at t/19-ext.t line 35.
# '<?xml version="1.0" encoding="UTF-8"?>
# <with_ns xmlns="XML::Atom::Namespace=HASH(0x2f1e668)" baz="1" />'
# doesn't match '(?^:<withns:with_ns.+xmlns:withns="http://example.com/withn
s/")'

# Failed test at t/19-ext.t line 38.
# '<?xml version="1.0" encoding="UTF-8"?>
# <feed xmlns="http://purl.org/atom/ns#"><foo xmlns="http://www.example.com/ns/"
><bar xmlns="http://www.example.com/ns/">1</bar></foo><foo2 xmlns="http://www.ex
ample.com/ns/"><bar xmlns="http://www.example.com/ns/">1</bar></foo2><with_ns xm
lns="XML::Atom::Namespace=HASH(0x2f1e668)" baz="1" /></feed>'
# doesn't match '(?^:<withns:with_ns.+xmlns:withns="http://example.com/withn
s/")'
# Looks like you failed 2 tests of 16.
t/19-ext.t ....................... Dubious, test returned 2 (wstat 512, 0x200)
Failed 2/16 subtests
t/20-content-xhtml.t ............. ok
t/23-category.t ..................
# Failed test at t/23-category.t line 9.
t/23-category.t .................. 1/? Can't call method "title" on an undefined
value at t/23-category.t line 10.
# Looks like you failed 1 test of 1.
# Looks like your test exited with 255 just after 1.
t/23-category.t .................. Dubious, test returned 255 (wstat 65280, 0xff
00)
Failed 1/1 subtests
t/24-bad-content.t ............... ok
t/25-utf8-create.t ............... 1/?
# Failed test at t/25-utf8-create.t line 17.
# got: undef
# expected: 'Dicion&#9500;írios'
# Looks like you failed 1 test of 2.
t/25-utf8-create.t ............... Dubious, test returned 1 (wstat 256, 0x100)
Failed 1/2 subtests
t/27-client-leaks.t .............. skipped: DateTime is required for tests
t/28-ext.t ....................... 1/8
# Failed test 'extension accessors'
# at t/28-ext.t line 61.
# got: undef
# expected: '2'

# Failed test 'extension accessors'
# at t/28-ext.t line 61.
# got: undef
# expected: '2'

# Failed test 'extension accessors'
# at t/28-ext.t line 61.
# got: undef
# expected: '2'

# Failed test 'ext link match'
# at t/28-ext.t line 66.
# '<?xml version="1.0" encoding="UTF-8"?>
# <feed xmlns="http://purl.org/atom/ns#"><link xmlns="http://purl.org/atom/ns#"
href="http://www.legacy_link.com" /><link xmlns="XML::Atom::Namespace=HASH(0x37e
fc8)" href="http://www.extended_link.org" /><totalResults xmlns:testext="http://
test.com/-/spec/test/0.1/">2</totalResults><startIndex xmlns:testext="http://tes
t.com/-/spec/test/0.1/">2</startIndex><itemsPerPage xmlns:testext="http://test.c
om/-/spec/test/0.1/">2</itemsPerPage></feed>'
# doesn't match '(?^:<testext:link xmlns:testext="http://test.com/-/spec/tes
t/0.1/" href="http://www.extended_link.org"/>)'

# Failed test 'ext method match'
# at t/28-ext.t line 68.
# '<?xml version="1.0" encoding="UTF-8"?>
# <feed xmlns="http://purl.org/atom/ns#"><link xmlns="http://purl.org/atom/ns#"
href="http://www.legacy_link.com" /><link xmlns="XML::Atom::Namespace=HASH(0x37e
fc8)" href="http://www.extended_link.org" /><totalResults xmlns:testext="http://
test.com/-/spec/test/0.1/">2</totalResults><startIndex xmlns:testext="http://tes
t.com/-/spec/test/0.1/">2</startIndex><itemsPerPage xmlns:testext="http://test.c
om/-/spec/test/0.1/">2</itemsPerPage></feed>'
# doesn't match '(?^:<testext:startIndex xmlns:testext="http://test.com/-/sp
ec/test/0.1/">2</testext:startIndex>)'

# Failed test 'standard link match'
# at t/28-ext.t line 70.
# '<?xml version="1.0" encoding="UTF-8"?>
# <feed xmlns="http://purl.org/atom/ns#"><link xmlns="http://purl.org/atom/ns#"
href="http://www.legacy_link.com" /><link xmlns="XML::Atom::Namespace=HASH(0x37e
fc8)" href="http://www.extended_link.org" /><totalResults xmlns:testext="http://
test.com/-/spec/test/0.1/">2</totalResults><startIndex xmlns:testext="http://tes
t.com/-/spec/test/0.1/">2</startIndex><itemsPerPage xmlns:testext="http://test.c
om/-/spec/test/0.1/">2</itemsPerPage></feed>'
# doesn't match '(?^:<link(?: xmlns="http://purl.org/atom/ns#")? href="http:
//www.legacy_link.com"/>)'
# Looks like you failed 6 tests of 8.
t/28-ext.t ....................... Dubious, test returned 6 (wstat 1536, 0x600)
Failed 6/8 subtests
t/29-source.t .................... 1/9
# Failed test at t/29-source.t line 9.
Can't call method "title" on an undefined value at t/29-source.t line 10.
# Looks like you planned 9 tests but ran 1.
# Looks like you failed 1 test of 1 run.
# Looks like your test exited with 255 just after 1.
t/29-source.t .................... Dubious, test returned 255 (wstat 65280, 0xff
00)
Failed 9/9 subtests
t/30-datetime-stringification.t .. skipped: DateTime and DateTime::Format::Atom
are required for tests
t/31-external-entities-libxml.t .. skipped: LibXML required for this test
t/31-external-entities-xpath.t ... External Entities disabled. at C:\Perl64\cpan
\build\XML-Atom-0.41-was4VA\blib\lib/XML/Atom.pm line 52.
t/31-external-entities-xpath.t ... ok

Test Summary Report
-------------------
t/11-entry.t (Wstat: 1536 Tests: 71 Failed: 6)
Failed tests: 43, 48, 66-69
Non-zero exit status: 6
t/12-feed.t (Wstat: 65280 Tests: 29 Failed: 0)
Non-zero exit status: 255
Parse errors: Bad plan. You planned 33 tests but ran 29.
t/13-atom1.t (Wstat: 65280 Tests: 5 Failed: 4)
Failed tests: 2-5
Non-zero exit status: 255
Parse errors: Bad plan. You planned 23 tests but ran 5.
t/17-renames.t (Wstat: 65280 Tests: 1 Failed: 0)
Non-zero exit status: 255
Parse errors: Bad plan. You planned 5 tests but ran 1.
t/19-ext.t (Wstat: 512 Tests: 16 Failed: 2)
Failed tests: 12-13
Non-zero exit status: 2
t/23-category.t (Wstat: 65280 Tests: 1 Failed: 1)
Failed test: 1
Non-zero exit status: 255
t/25-utf8-create.t (Wstat: 256 Tests: 2 Failed: 1)
Failed test: 2
Non-zero exit status: 1
t/28-ext.t (Wstat: 1536 Tests: 8 Failed: 6)
Failed tests: 2-4, 6-8
Non-zero exit status: 6
t/29-source.t (Wstat: 65280 Tests: 1 Failed: 1)
Failed test: 1
Non-zero exit status: 255
Parse errors: Bad plan. You planned 9 tests but ran 1.
Files=24, Tests=216, 8 wallclock secs ( 0.19 usr + 0.08 sys = 0.27 CPU)
Result: FAIL
Failed 9/24 test programs. 21/216 subtests failed.
NMAKE : fatal error U1077: 'C:\Perl64\bin\perl.exe' : return code '0xff'
Stop.
MIYAGAWA/XML-Atom-0.41.tar.gz
3 dependencies missing (DateTime::TimeZone,DateTime,XML::LibXML); additionally t
est harness failed
C:\PROGRA~2\MIB055~1\VC98\bin\nmake.exe test -- NOT OK
//hint// to see the cpan-testers results for installing this module, try:
reports MIYAGAWA/XML-Atom-0.41.tar.gz
Running make install
make test had returned bad status, won't install without force
Running make for S/SE/SEKIMURA/AnyEvent-Gmail-Feed-0.02.tar.gz
Has already been unwrapped into directory C:\Perl64\cpan\build\AnyEvent-Gmail-
Feed-0.02-x2oA90

CPAN.pm: Building S/SE/SEKIMURA/AnyEvent-Gmail-Feed-0.02.tar.gz

Warning: Prerequisite 'XML::Atom::Feed => 0' for 'S/SE/SEKIMURA/AnyEvent-Gmail-F
eed-0.02.tar.gz' seems not available according to the indices

Microsoft (R) Program Maintenance Utility Version 6.00.8168.0
Copyright (C) Microsoft Corp 1988-1998. All rights reserved.

cp lib/AnyEvent/Gmail/Feed.pm blib\lib\AnyEvent\Gmail\Feed.pm
SEKIMURA/AnyEvent-Gmail-Feed-0.02.tar.gz
C:\PROGRA~2\MIB055~1\VC98\bin\nmake.exe -- OK
Running make test

Microsoft (R) Program Maintenance Utility Version 6.00.8168.0
Copyright (C) Microsoft Corp 1988-1998. All rights reserved.

C:\Perl64\bin\perl.exe "-MExtUtils::Command::MM" "-e" "test_harness(0, '
inc', 'blib\lib', 'blib\arch')" t/*.t
t/00_compile.t ..
# Failed test 'use AnyEvent::Gmail::Feed;'
t/00_compile.t .. 1/1 # at t/00_compile.t line 4.
# Tried to use 'AnyEvent::Gmail::Feed'.
# Error: Can't locate XML/Atom/Feed.pm in @INC (@INC contains: C:\Perl64\cp
an\build\AnyEvent-Gmail-Feed-0.02-x2oA90\inc C:\Perl64\cpan\build\AnyEvent-Gmail
-Feed-0.02-x2oA90\blib\lib C:\Perl64\cpan\build\AnyEvent-Gmail-Feed-0.02-x2oA90\
blib\arch C:/Perl64/site/lib C:/Perl64/lib .) at C:\Perl64\cpan\build\AnyEvent-G
mail-Feed-0.02-x2oA90\blib\lib/AnyEvent/Gmail/Feed.pm line 10.
# BEGIN failed--compilation aborted at C:\Perl64\cpan\build\AnyEvent-Gmail-Feed-
0.02-x2oA90\blib\lib/AnyEvent/Gmail/Feed.pm line 10.
# Compilation failed in require at (eval 2) line 2.
# BEGIN failed--compilation aborted at (eval 2) line 2.
# Looks like you failed 1 test of 1.
t/00_compile.t .. Dubious, test returned 1 (wstat 256, 0x100)
Failed 1/1 subtests

Test Summary Report
-------------------
t/00_compile.t (Wstat: 256 Tests: 1 Failed: 1)
Failed test: 1
Non-zero exit status: 1
Files=1, Tests=1, 1 wallclock secs ( 0.03 usr + 0.05 sys = 0.08 CPU)
Result: FAIL
Failed 1/1 test programs. 1/1 subtests failed.
NMAKE : fatal error U1077: 'C:\Perl64\bin\perl.exe' : return code '0x1'
Stop.
SEKIMURA/AnyEvent-Gmail-Feed-0.02.tar.gz
one dependency not OK (XML::Atom::Feed); additionally test harness failed
C:\PROGRA~2\MIB055~1\VC98\bin\nmake.exe test -- NOT OK
//hint// to see the cpan-testers results for installing this module, try:
reports SEKIMURA/AnyEvent-Gmail-Feed-0.02.tar.gz
Running make install
make test had returned bad status, won't install without force
Could not read metadata file. Falling back to other methods to determine prerequ
isites


D:\Zulfi\PERL MAIN FOLDER>


I have tried to install DateTime & ATOM module but they all giving circular dependency error.

Zulfi.


zak100
User

Nov 25, 2014, 10:33 AM

Post #13 of 44 (17775 views)
Re: [zak100] Automatic reply to email [In reply to] Can't Post

Hi,
It says makefile not okay.

Code
D:\Zulfi\PERL MAIN FOLDER>cpan List::Util 
CPAN: Term::ANSIColor loaded ok (v4.02)
CPAN: Storable loaded ok (v2.34)
Reading 'C:\Perl64\cpan\Metadata'
Database was generated on Tue, 25 Nov 2014 10:41:02 GMT
Running install for module 'List::Util'
Running make for P/PE/PEVANS/Scalar-List-Utils-1.41.tar.gz
CPAN: Digest::SHA loaded ok (v5.84)
CPAN: Compress::Zlib loaded ok (v2.06)
Checksum for C:\Perl64\cpan\sources\authors\id\P\PE\PEVANS\Scalar-List-Utils-1.4
1.tar.gz ok
CPAN: Archive::Tar loaded ok (v1.90)
Scalar-List-Utils-1.41/
Scalar-List-Utils-1.41/MYMETA.yml
Scalar-List-Utils-1.41/lib/
Scalar-List-Utils-1.41/lib/Scalar/
Scalar-List-Utils-1.41/lib/Scalar/Util.pm
Scalar-List-Utils-1.41/lib/Sub/
Scalar-List-Utils-1.41/lib/Sub/Util.pm
Scalar-List-Utils-1.41/lib/List/
Scalar-List-Utils-1.41/lib/List/Util.pm
Scalar-List-Utils-1.41/lib/List/Util/
Scalar-List-Utils-1.41/lib/List/Util/XS.pm
Scalar-List-Utils-1.41/MANIFEST
Scalar-List-Utils-1.41/MYMETA.json
Scalar-List-Utils-1.41/META.json
Scalar-List-Utils-1.41/ListUtil.xs
Scalar-List-Utils-1.41/t/
Scalar-List-Utils-1.41/t/minstr.t
Scalar-List-Utils-1.41/t/refaddr.t
Scalar-List-Utils-1.41/t/shuffle.t
Scalar-List-Utils-1.41/t/prototype.t
Scalar-List-Utils-1.41/t/min.t
Scalar-List-Utils-1.41/t/reftype.t
Scalar-List-Utils-1.41/t/sum0.t
Scalar-List-Utils-1.41/t/readonly.t
Scalar-List-Utils-1.41/t/maxstr.t
Scalar-List-Utils-1.41/t/weak.t
Scalar-List-Utils-1.41/t/dualvar.t
Scalar-List-Utils-1.41/t/reduce.t
Scalar-List-Utils-1.41/t/blessed.t
Scalar-List-Utils-1.41/t/openhan.t
Scalar-List-Utils-1.41/t/subname.t
Scalar-List-Utils-1.41/t/any-all.t
Scalar-List-Utils-1.41/t/product.t
Scalar-List-Utils-1.41/t/isvstring.t
Scalar-List-Utils-1.41/t/00version.t
Scalar-List-Utils-1.41/t/sum.t
Scalar-List-Utils-1.41/t/scalarutil-proto.t
Scalar-List-Utils-1.41/t/getmagic-once.t
Scalar-List-Utils-1.41/t/tainted.t
Scalar-List-Utils-1.41/t/pair.t
Scalar-List-Utils-1.41/t/max.t
Scalar-List-Utils-1.41/t/first.t
Scalar-List-Utils-1.41/t/stack-corruption.t
Scalar-List-Utils-1.41/t/lln.t
Scalar-List-Utils-1.41/multicall.h
Scalar-List-Utils-1.41/Changes
Scalar-List-Utils-1.41/Makefile.PL
Scalar-List-Utils-1.41/README
Scalar-List-Utils-1.41/META.yml
Scalar-List-Utils-1.41/ppport.h
CPAN: File::Temp loaded ok (v0.22)
CPAN: Parse::CPAN::Meta loaded ok (v1.4404)
CPAN: CPAN::Meta loaded ok (v2.120921)
CPAN: Module::CoreList loaded ok (v2.80)

CPAN.pm: Building P/PE/PEVANS/Scalar-List-Utils-1.41.tar.gz

Checking if your kit is complete...
Looks good
Writing Makefile for List::Util
Writing MYMETA.yml and MYMETA.json

Microsoft (R) Program Maintenance Utility Version 6.00.8168.0
Copyright (C) Microsoft Corp 1988-1998. All rights reserved.

cp lib/List/Util/XS.pm blib\lib\List\Util\XS.pm
cp lib/Sub/Util.pm blib\lib\Sub\Util.pm
cp lib/List/Util.pm blib\lib\List\Util.pm
cp lib/Scalar/Util.pm blib\lib\Scalar\Util.pm
C:\Perl64\bin\perl.exe C:\Perl64\lib\ExtUtils\xsubpp -typemap C:\Perl64
\lib\ExtUtils\typemap ListUtil.xs > ListUtil.xsc && C:\Perl64\bin\perl.exe -MEx
tUtils::Command -e mv -- ListUtil.xsc ListUtil.c
cl -c -nologo -GF -W3 -MD -Zi -DNDEBUG -Ox -GL -fp:precise -DWIN32 -D
_CONSOLE -DNO_STRICT -DWIN64 -DCONSERVATIVE -DPERL_TEXTMODE_SCRIPTS -DUSE_SITECU
STOMIZE -DPERL_IMPLICIT_CONTEXT -DPERL_IMPLICIT_SYS -DUSE_PERLIO -MD -Zi -DNDEBU
G -Ox -GL -fp:precise -DVERSION=\"1.41\" -DXS_VERSION=\"1.41\" "-IC:\Perl64
\lib\CORE" -DPERL_EXT ListUtil.c
Command line warning D4002 : ignoring unknown option '-GL'
Command line warning D4002 : ignoring unknown option '-fp:precise'
Command line warning D4002 : ignoring unknown option '-GL'
Command line warning D4002 : ignoring unknown option '-fp:precise'
ListUtil.c
ListUtil.xs(230) : warning C4244: '=' : conversion from '__int64 ' to 'double ',
possible loss of data
ListUtil.xs(330) : warning C4244: 'initializing' : conversion from 'const long '
to 'unsigned char ', possible loss of data
ListUtil.xs(383) : warning C4244: 'initializing' : conversion from 'const long '
to 'unsigned char ', possible loss of data
ListUtil.xs(451) : warning C4244: 'initializing' : conversion from 'const long '
to 'unsigned char ', possible loss of data
ListUtil.xs(512) : warning C4244: 'initializing' : conversion from 'const long '
to 'unsigned char ', possible loss of data
ListUtil.xs(596) : warning C4244: 'initializing' : conversion from 'const long '
to 'unsigned char ', possible loss of data
ListUtil.xs(686) : warning C4244: 'initializing' : conversion from 'const long '
to 'unsigned char ', possible loss of data
ListUtil.xs(109) : error C2520: conversion from unsigned __int64 to double not i
mplemented, use signed __int64
ListUtil.xs(119) : error C2520: conversion from unsigned __int64 to double not i
mplemented, use signed __int64
ListUtil.xs(124) : error C2520: conversion from unsigned __int64 to double not i
mplemented, use signed __int64
ListUtil.xs(126) : error C2520: conversion from unsigned __int64 to double not i
mplemented, use signed __int64
ListUtil.xs(176) : error C2520: conversion from unsigned __int64 to double not i
mplemented, use signed __int64
ListUtil.xs(202) : error C2520: conversion from unsigned __int64 to double not i
mplemented, use signed __int64
ListUtil.xs(234) : error C2520: conversion from unsigned __int64 to double not i
mplemented, use signed __int64
ListUtil.xs(234) : error C2520: conversion from unsigned __int64 to double not i
mplemented, use signed __int64
NMAKE : fatal error U1077: 'cl' : return code '0x2'
Stop.
PEVANS/Scalar-List-Utils-1.41.tar.gz
C:\PROGRA~2\MIB055~1\VC98\bin\nmake.exe -- NOT OK
CPAN: YAML::XS loaded ok (v0.39)
Running make test
Can't test without successful make
Running make install
Make had returned bad status, install seems impossible

D:\Zulfi\PERL MAIN FOLDER>


Zulfi.


FishMonger
Veteran / Moderator

Nov 25, 2014, 10:59 AM

Post #14 of 44 (17769 views)
Re: [zak100] Automatic reply to email [In reply to] Can't Post

List::Util is a core module and should already be installed so why are yo trying to install it?

Some of your problems may be that some of the modules you're trying to install are 32 bit versions and are not compatible with 64 perl.

It appears, from the error message, that the version of nmake you're using doesn't support a couple of the compiler options used to build the module. What version of nmake do you have installed?

Maybe you should switch to another compiler i.e., dmake instead of nmake.


(This post was edited by FishMonger on Nov 25, 2014, 11:02 AM)


pstewart
Novice

Nov 25, 2014, 12:15 PM

Post #15 of 44 (17758 views)
Re: [zak100] Automatic reply to email [In reply to] Can't Post


In Reply To
Hi,
Are you from them? You are speaking like them. It seems you are!

I am OBVIOUSLY a member of several other forums, where you have posted spam like this for years, and gone asking for people to do your stuff for you.

In Reply To
I got some solution from the follwoing site for gmailchecker.pl:

https://communities.vmware.com/message/2444510
It asks to do some installation. I am not confident to do it. I dont know how to download SSL certificate from the vCenter??

so if you don't want to do whats suggested, why both asking anyone else what to do?

In Reply To
About AnyEvent::GMail::Feed, I tried to install again it worked using i option (cant write the exact command because that window is lost).
I am getting circular dependency error:

just like we get when trying to help you....can you not read the instructions that come with the perl modules from cpan? download the .gz file, uncompress it, type in "perl Makefile.PL", then "make", "make test", and "sudo make install" that will typically install 90+% of perl modules, and the rest have instructions.

you have been posting things like this for YEARS....it takes SECONDS to fix and read. you've spent more time posting garbage like this, than it would have tkaen you to write a dozen cpan modules.


zak100
User

Nov 26, 2014, 7:33 AM

Post #16 of 44 (17704 views)
Re: [pstewart] Automatic reply to email [In reply to] Can't Post

Hi,I have downloaded AnyEvent::GMail::Feed, but now i am getting problems in compilation. Its saying it cant find XML::Atom::Feed. I can find XML::Atom::Feed. I downloaded XML-Atom-0.4 and stored in the AnyEvent::GMail::Feed directory but it cant find it.
Please guide me.
Zulfi.

Code
D:\AnyEvent-Gmail-Feed-0.02>perl MakeFile.pl 
Checking if your kit is complete...
Looks good
Warning: prerequisite XML::Atom::Feed 0 not found.
Writing Makefile for AnyEvent::Gmail::Feed
Writing MYMETA.yml and MYMETA.json

D:\AnyEvent-Gmail-Feed-0.02>perl MakeFile.pl
Warning: prerequisite XML::Atom::Feed 0 not found.
Writing Makefile for AnyEvent::Gmail::Feed
Writing MYMETA.yml and MYMETA.json

D:\AnyEvent-Gmail-Feed-0.02>perl MakeFile.pl
Warning: prerequisite XML::Atom::Feed 0 not found.
Writing Makefile for AnyEvent::Gmail::Feed
Writing MYMETA.yml and MYMETA.json

D:\AnyEvent-Gmail-Feed-0.02>dir
Volume in drive D has no label.
Volume Serial Number is 8E4F-05BE

Directory of D:\AnyEvent-Gmail-Feed-0.02

11/26/2014 08:28 PM <DIR> .
11/26/2014 08:28 PM <DIR> ..
07/24/2009 10:26 PM 63 .gitignore
07/25/2009 03:01 AM 211 Changes
11/26/2014 07:21 PM <DIR> example
11/26/2014 07:21 PM <DIR> inc
11/26/2014 07:21 PM <DIR> lib
11/26/2014 08:28 PM 24,859 Makefile
07/25/2009 03:01 AM 328 Makefile.PL
07/24/2009 10:26 PM 648 MANIFEST
07/25/2009 03:05 AM 573 META.yml
11/26/2014 08:28 PM 1,131 MYMETA.json
11/26/2014 08:28 PM 647 MYMETA.yml
07/24/2009 10:26 PM 585 README
11/26/2014 07:21 PM <DIR> t
11/26/2014 08:23 PM <DIR> XML-Atom-0.41
11/26/2014 07:21 PM <DIR> xt
9 File(s) 29,045 bytes
8 Dir(s) 495,545,544,704 bytes free

D:\AnyEvent-Gmail-Feed-0.02>



FishMonger
Veteran / Moderator

Nov 26, 2014, 7:39 AM

Post #17 of 44 (17703 views)
Re: [zak100] Automatic reply to email [In reply to] Can't Post

Don't manually download and build modules unless you really need to, which is rare.

Use the cpan or cpanm utility. They will handle the download and install the prerequisites for you.


zak100
User

Nov 26, 2014, 7:49 AM

Post #18 of 44 (17701 views)
Re: [FishMonger] Automatic reply to email [In reply to] Can't Post

Hi,
I tried to download it using cpan in post#12 but its not working.

Zulfi.


FishMonger
Veteran / Moderator

Nov 26, 2014, 8:07 AM

Post #19 of 44 (17697 views)
Re: [zak100] Automatic reply to email [In reply to] Can't Post


Quote
D:\Zulfi\PERL MAIN FOLDER>cpan i/AnyEvent::GMail::Feed


You're missing the trailing /

Here's my failed example:

Code
C:\>cpan AnyEvent::GMail::Feed 
CPAN: CPAN::SQLite loaded ok (v0.203)
CPAN: LWP::UserAgent loaded ok (v6.05)
CPAN: Time::HiRes loaded ok (v1.9726)
Fetching with LWP:
http://cpan.strawberryperl.com/authors/01mailrc.txt.gz
CPAN: YAML::XS loaded ok (v0.41)
Fetching with LWP:
http://cpan.strawberryperl.com/modules/02packages.details.txt.gz
Fetching with LWP:
http://cpan.strawberryperl.com/modules/03modlist.data.gz
Database was generated on Thu, 20 Nov 2014 22:32:18 GMT

Updating database file ...
Done!
Warning: Cannot install AnyEvent::GMail::Feed, don't know what it is.
Try the command

i /AnyEvent::GMail::Feed/

to find objects with matching identifiers.


Here's the successful install.

Code
C:\>cpan -i /AnyEvent::GMail::Feed/ 
CPAN: CPAN::SQLite loaded ok (v0.203)
Database was generated on Wed, 26 Nov 2014 15:52:44 GMT

Running install for module 'AnyEvent::Gmail::Feed'
Running make for S/SE/SEKIMURA/AnyEvent-Gmail-Feed-0.02.tar.gz
CPAN: LWP::UserAgent loaded ok (v6.05)
CPAN: Time::HiRes loaded ok (v1.9726)
Fetching with LWP:
http://cpan.strawberryperl.com/authors/id/S/SE/SEKIMURA/AnyEvent-Gmail-Feed-0.02.tar.gz
CPAN: YAML::XS loaded ok (v0.41)
CPAN: Digest::SHA loaded ok (v5.88)
Fetching with LWP:
http://cpan.strawberryperl.com/authors/id/S/SE/SEKIMURA/CHECKSUMS
CPAN: Compress::Zlib loaded ok (v2.064)
Checksum for G:\perl\cpan\sources\authors\id\S\SE\SEKIMURA\AnyEvent-Gmail-Feed-0.02.tar.gz ok
CPAN: Archive::Tar loaded ok (v1.96)
CPAN: File::Temp loaded ok (v0.2304)
CPAN: Parse::CPAN::Meta loaded ok (v1.4414)
CPAN: CPAN::Meta loaded ok (v2.140640)

CPAN.pm: Building S/SE/SEKIMURA/AnyEvent-Gmail-Feed-0.02.tar.gz

Checking if your kit is complete...
Looks good
Warning: prerequisite AnyEvent 0 not found.
Warning: prerequisite AnyEvent::HTTP 0 not found.
Warning: prerequisite XML::Atom::Feed 0 not found.
Generating a dmake-style Makefile
Writing Makefile for AnyEvent::Gmail::Feed
Writing MYMETA.yml and MYMETA.json
CPAN: Module::CoreList loaded ok (v3.09)
---- Unsatisfied dependencies detected during ----
---- SEKIMURA/AnyEvent-Gmail-Feed-0.02.tar.gz ----
AnyEvent [requires]
XML::Atom::Feed [requires]
AnyEvent::HTTP [requires]
Running make test
Delayed until after prerequisites
Running make install
Delayed until after prerequisites
Running install for module 'AnyEvent'
Running make for M/ML/MLEHMANN/AnyEvent-7.07.tar.gz
Fetching with LWP:
http://cpan.strawberryperl.com/authors/id/M/ML/MLEHMANN/AnyEvent-7.07.tar.gz
Checksum for G:\perl\cpan\sources\authors\id\M\ML\MLEHMANN\AnyEvent-7.07.tar.gz ok

CPAN.pm: Building M/ML/MLEHMANN/AnyEvent-7.07.tar.gz


***
*** The EV module is recommended for even better performance, unless you
*** have to use one of the other adaptors (Event, Glib, Tk, etc.).
*** The Async::Interrupt module is highly recommended to efficiently avoid
*** race conditions in/with other event loops.
***
*** This module does not have ANY dependencies, even if it might look
*** otherwise. If you are building a distribution package or have
*** difficulties installing this package due to dependencies, report this
*** to the packager as a bug.
***
*** This module is guaranteed to stay 100% pure-perl, full-featured
*** and performant, even without any of the optional modules.
***

Checking if your kit is complete...
Looks good
Generating a dmake-style Makefile
Writing Makefile for AnyEvent
Writing MYMETA.yml and MYMETA.json
cp lib/AnyEvent/Impl/EV.pm blib\lib/AnyEvent/Impl/EV.pm
cp lib/AnyEvent.pm blib\lib/AnyEvent.pm
cp lib/AnyEvent/Impl/Tk.pm blib\lib/AnyEvent/Impl/Tk.pm
cp lib/AnyEvent/Intro.pod blib\lib/AnyEvent/Intro.pod
cp lib/AnyEvent/Impl/Glib.pm blib\lib/AnyEvent/Impl/Glib.pm
cp lib/AnyEvent/Impl/FLTK.pm blib\lib/AnyEvent/Impl/FLTK.pm
cp lib/AnyEvent/Impl/IOAsync.pm blib\lib/AnyEvent/Impl/IOAsync.pm
cp lib/AnyEvent/Debug.pm blib\lib/AnyEvent/Debug.pm
cp lib/AnyEvent/Impl/Cocoa.pm blib\lib/AnyEvent/Impl/Cocoa.pm
cp lib/AnyEvent/IO/Perl.pm blib\lib/AnyEvent/IO/Perl.pm
cp lib/AnyEvent/Handle.pm blib\lib/AnyEvent/Handle.pm
cp lib/AnyEvent/DNS.pm blib\lib/AnyEvent/DNS.pm
cp lib/AnyEvent/Impl/Event.pm blib\lib/AnyEvent/Impl/Event.pm
cp lib/AnyEvent/Impl/Irssi.pm blib\lib/AnyEvent/Impl/Irssi.pm
cp lib/AE.pm blib\lib/AE.pm
cp lib/AnyEvent/Impl/Qt.pm blib\lib/AnyEvent/Impl/Qt.pm
cp lib/AnyEvent/Impl/EventLib.pm blib\lib/AnyEvent/Impl/EventLib.pm
cp lib/AnyEvent/FAQ.pod blib\lib/AnyEvent/FAQ.pod
cp lib/AnyEvent/Impl/Perl.pm blib\lib/AnyEvent/Impl/Perl.pm
cp lib/AnyEvent/IO/IOAIO.pm blib\lib/AnyEvent/IO/IOAIO.pm
cp lib/AnyEvent/Impl/POE.pm blib\lib/AnyEvent/Impl/POE.pm
cp lib/AnyEvent/IO.pm blib\lib/AnyEvent/IO.pm
cp lib/AnyEvent/Util/uts46data.pl blib\lib/AnyEvent/Util/uts46data.pl
cp lib/AnyEvent/constants.pl blib\arch/AnyEvent/constants.pl
cp lib/AnyEvent/Loop.pm blib\lib/AnyEvent/Loop.pm
cp lib/AnyEvent/Util/idna.pl blib\lib/AnyEvent/Util/idna.pl
cp lib/AnyEvent/TLS.pm blib\lib/AnyEvent/TLS.pm
cp lib/AnyEvent/Log.pm blib\lib/AnyEvent/Log.pm
cp lib/AnyEvent/Strict.pm blib\lib/AnyEvent/Strict.pm
cp lib/AnyEvent/Socket.pm blib\lib/AnyEvent/Socket.pm
cp lib/AnyEvent/Util.pm blib\lib/AnyEvent/Util.pm
"G:\perl\perl\bin\perl.exe" "-Iblib\arch" "-Iblib\lib" constants.pl.PL constants.pl
MLEHMANN/AnyEvent-7.07.tar.gz
G:\perl\c\bin\dmake.exe -- OK
Running make test
"G:\perl\perl\bin\perl.exe" "-MExtUtils::Command::MM" "-MTest::Harness" "-e" "undef *Test::Harness::Switches; test_harne
ss(0, 'blib\lib', 'blib\arch')" t/*.t t/handle/*.t
t/00_load.t ................ ok
t/01_basic.t ............... ok
t/02_signals.t ............. skipped: Broken perl detected, skipping tests.
t/03_child.t ............... skipped: Your perl interpreter is badly BROKEN. Child watchers will not work, ever. Try upg
rading to a newer perl or a working perl (cygwin's perl is known to work). If that is not an option, you should be able
to use the remaining functionality of AnyEvent, but child watchers WILL NOT WORK.
t/04_condvar.t ............. ok
t/05_dns.t ................. ok
t/06_socket.t .............. ok
t/07_io.t .................. ok
t/08_idna.t ................ ok
t/09_multi.t ............... skipped: Your perl interpreter is badly BROKEN. Child watchers will not work, ever. Try upg
rading to a newer perl or a working perl (cygwin's perl is known to work). If that is not an option, you should be able
to use the remaining functionality of AnyEvent, but child watchers WILL NOT WORK.
t/10_loadall.t ............. ok
t/11_io_perl.t ............. ok
t/12_io_ioaio.t ............ skipped: AnyEvent::IO::IOAIO not loadable
t/61_fltk_01_basic.t ....... skipped: PERL_ANYEVENT_LOOP_TESTS not true
t/61_fltk_02_signals.t ..... skipped: Broken perl detected, skipping tests.
t/61_fltk_03_child.t ....... skipped: Your perl interpreter is badly BROKEN. Child watchers will not work, ever. Try upg
rading to a newer perl or a working perl (cygwin's perl is known to work). If that is not an option, you should be able
to use the remaining functionality of AnyEvent, but child watchers WILL NOT WORK.
t/61_fltk_04_condvar.t ..... skipped: PERL_ANYEVENT_LOOP_TESTS not true
t/61_fltk_05_dns.t ......... skipped: PERL_ANYEVENT_LOOP_TESTS not true
t/61_fltk_07_io.t .......... skipped: PERL_ANYEVENT_LOOP_TESTS not true
t/61_fltk_09_multi.t ....... skipped: Your perl interpreter is badly BROKEN. Child watchers will not work, ever. Try upg
rading to a newer perl or a working perl (cygwin's perl is known to work). If that is not an option, you should be able
to use the remaining functionality of AnyEvent, but child watchers WILL NOT WORK.
t/62_cocoa_01_basic.t ...... skipped: PERL_ANYEVENT_LOOP_TESTS not true
t/62_cocoa_02_signals.t .... skipped: Broken perl detected, skipping tests.
t/62_cocoa_03_child.t ...... skipped: Your perl interpreter is badly BROKEN. Child watchers will not work, ever. Try upg
rading to a newer perl or a working perl (cygwin's perl is known to work). If that is not an option, you should be able
to use the remaining functionality of AnyEvent, but child watchers WILL NOT WORK.
t/62_cocoa_04_condvar.t .... skipped: PERL_ANYEVENT_LOOP_TESTS not true
t/62_cocoa_05_dns.t ........ skipped: PERL_ANYEVENT_LOOP_TESTS not true
t/62_cocoa_07_io.t ......... skipped: PERL_ANYEVENT_LOOP_TESTS not true
t/62_cocoa_09_multi.t ...... skipped: Your perl interpreter is badly BROKEN. Child watchers will not work, ever. Try upg
rading to a newer perl or a working perl (cygwin's perl is known to work). If that is not an option, you should be able
to use the remaining functionality of AnyEvent, but child watchers WILL NOT WORK.
t/64_glib_01_basic.t ....... skipped: PERL_ANYEVENT_LOOP_TESTS not true
t/64_glib_02_signals.t ..... skipped: Broken perl detected, skipping tests.
t/64_glib_03_child.t ....... skipped: Your perl interpreter is badly BROKEN. Child watchers will not work, ever. Try upg
rading to a newer perl or a working perl (cygwin's perl is known to work). If that is not an option, you should be able
to use the remaining functionality of AnyEvent, but child watchers WILL NOT WORK.
t/64_glib_04_condvar.t ..... skipped: PERL_ANYEVENT_LOOP_TESTS not true
t/64_glib_05_dns.t ......... skipped: PERL_ANYEVENT_LOOP_TESTS not true
t/64_glib_07_io.t .......... skipped: PERL_ANYEVENT_LOOP_TESTS not true
t/64_glib_09_multi.t ....... skipped: Your perl interpreter is badly BROKEN. Child watchers will not work, ever. Try upg
rading to a newer perl or a working perl (cygwin's perl is known to work). If that is not an option, you should be able
to use the remaining functionality of AnyEvent, but child watchers WILL NOT WORK.
t/65_event_01_basic.t ...... skipped: PERL_ANYEVENT_LOOP_TESTS not true
t/65_event_02_signals.t .... skipped: Broken perl detected, skipping tests.
t/65_event_03_child.t ...... skipped: Your perl interpreter is badly BROKEN. Child watchers will not work, ever. Try upg
rading to a newer perl or a working perl (cygwin's perl is known to work). If that is not an option, you should be able
to use the remaining functionality of AnyEvent, but child watchers WILL NOT WORK.
t/65_event_04_condvar.t .... skipped: PERL_ANYEVENT_LOOP_TESTS not true
t/65_event_05_dns.t ........ skipped: PERL_ANYEVENT_LOOP_TESTS not true
t/65_event_07_io.t ......... skipped: PERL_ANYEVENT_LOOP_TESTS not true
t/65_event_09_multi.t ...... skipped: Your perl interpreter is badly BROKEN. Child watchers will not work, ever. Try upg
rading to a newer perl or a working perl (cygwin's perl is known to work). If that is not an option, you should be able
to use the remaining functionality of AnyEvent, but child watchers WILL NOT WORK.
t/66_ioasync_01_basic.t .... skipped: PERL_ANYEVENT_LOOP_TESTS not true
t/66_ioasync_02_signals.t .. skipped: Broken perl detected, skipping tests.
t/66_ioasync_03_child.t .... skipped: Your perl interpreter is badly BROKEN. Child watchers will not work, ever. Try upg
rading to a newer perl or a working perl (cygwin's perl is known to work). If that is not an option, you should be able
to use the remaining functionality of AnyEvent, but child watchers WILL NOT WORK.
t/66_ioasync_04_condvar.t .. skipped: PERL_ANYEVENT_LOOP_TESTS not true
t/66_ioasync_05_dns.t ...... skipped: PERL_ANYEVENT_LOOP_TESTS not true
t/66_ioasync_07_io.t ....... skipped: PERL_ANYEVENT_LOOP_TESTS not true
t/66_ioasync_09_multi.t .... skipped: Your perl interpreter is badly BROKEN. Child watchers will not work, ever. Try upg
rading to a newer perl or a working perl (cygwin's perl is known to work). If that is not an option, you should be able
to use the remaining functionality of AnyEvent, but child watchers WILL NOT WORK.
t/67_tk_01_basic.t ......... skipped: PERL_ANYEVENT_LOOP_TESTS not true
t/67_tk_02_signals.t ....... skipped: Broken perl detected, skipping tests.
t/67_tk_03_child.t ......... skipped: Your perl interpreter is badly BROKEN. Child watchers will not work, ever. Try upg
rading to a newer perl or a working perl (cygwin's perl is known to work). If that is not an option, you should be able
to use the remaining functionality of AnyEvent, but child watchers WILL NOT WORK.
t/67_tk_04_condvar.t ....... skipped: PERL_ANYEVENT_LOOP_TESTS not true
t/67_tk_05_dns.t ........... skipped: PERL_ANYEVENT_LOOP_TESTS not true
t/67_tk_07_io.t ............ skipped: PERL_ANYEVENT_LOOP_TESTS not true
t/67_tk_09_multi.t ......... skipped: Your perl interpreter is badly BROKEN. Child watchers will not work, ever. Try upg
rading to a newer perl or a working perl (cygwin's perl is known to work). If that is not an option, you should be able
to use the remaining functionality of AnyEvent, but child watchers WILL NOT WORK.
t/68_poe_01_basic.t ........ skipped: PERL_ANYEVENT_LOOP_TESTS not true
t/68_poe_02_signals.t ...... skipped: Broken perl detected, skipping tests.
t/68_poe_03_child.t ........ skipped: Your perl interpreter is badly BROKEN. Child watchers will not work, ever. Try upg
rading to a newer perl or a working perl (cygwin's perl is known to work). If that is not an option, you should be able
to use the remaining functionality of AnyEvent, but child watchers WILL NOT WORK.
t/68_poe_04_condvar.t ...... skipped: PERL_ANYEVENT_LOOP_TESTS not true
t/68_poe_05_dns.t .......... skipped: PERL_ANYEVENT_LOOP_TESTS not true
t/68_poe_07_io.t ........... skipped: PERL_ANYEVENT_LOOP_TESTS not true
t/68_poe_09_multi.t ........ skipped: Your perl interpreter is badly BROKEN. Child watchers will not work, ever. Try upg
rading to a newer perl or a working perl (cygwin's perl is known to work). If that is not an option, you should be able
to use the remaining functionality of AnyEvent, but child watchers WILL NOT WORK.
t/69_ev_01_basic.t ......... skipped: PERL_ANYEVENT_LOOP_TESTS not true
t/69_ev_02_signals.t ....... skipped: Broken perl detected, skipping tests.
t/69_ev_03_child.t ......... skipped: Your perl interpreter is badly BROKEN. Child watchers will not work, ever. Try upg
rading to a newer perl or a working perl (cygwin's perl is known to work). If that is not an option, you should be able
to use the remaining functionality of AnyEvent, but child watchers WILL NOT WORK.
t/69_ev_04_condvar.t ....... skipped: PERL_ANYEVENT_LOOP_TESTS not true
t/69_ev_05_dns.t ........... skipped: PERL_ANYEVENT_LOOP_TESTS not true
t/69_ev_07_io.t ............ skipped: PERL_ANYEVENT_LOOP_TESTS not true
t/69_ev_09_multi.t ......... skipped: Your perl interpreter is badly BROKEN. Child watchers will not work, ever. Try upg
rading to a newer perl or a working perl (cygwin's perl is known to work). If that is not an option, you should be able
to use the remaining functionality of AnyEvent, but child watchers WILL NOT WORK.
t/80_ssltest.t ............. ok
t/81_hosts.t ............... ok
t/handle/01_readline.t ..... ok
t/handle/02_write.t ........ ok
t/handle/03_http_req.t ..... skipped: PERL_ANYEVENT_NET_TESTS environment variable not set
t/handle/04_listen.t ....... ok
All tests successful.
Files=75, Tests=595, 8 wallclock secs ( 0.27 usr + 0.16 sys = 0.42 CPU)
Result: PASS
MLEHMANN/AnyEvent-7.07.tar.gz
G:\perl\c\bin\dmake.exe test -- OK
Running make install
"G:\perl\perl\bin\perl.exe" "-Iblib\arch" "-Iblib\lib" constants.pl.PL constants.pl
Files found in blib\arch: installing files in blib\lib into architecture dependent library tree
Installing G:\perl\perl\site\lib\AnyEvent\constants.pl
Installing G:\perl\perl\site\lib\AE.pm
Installing G:\perl\perl\site\lib\AnyEvent.pm
Installing G:\perl\perl\site\lib\AnyEvent\Debug.pm
Installing G:\perl\perl\site\lib\AnyEvent\DNS.pm
Installing G:\perl\perl\site\lib\AnyEvent\FAQ.pod
Installing G:\perl\perl\site\lib\AnyEvent\Handle.pm
Installing G:\perl\perl\site\lib\AnyEvent\Intro.pod
Installing G:\perl\perl\site\lib\AnyEvent\IO.pm
Installing G:\perl\perl\site\lib\AnyEvent\Log.pm
Installing G:\perl\perl\site\lib\AnyEvent\Loop.pm
Installing G:\perl\perl\site\lib\AnyEvent\Socket.pm
Installing G:\perl\perl\site\lib\AnyEvent\Strict.pm
Installing G:\perl\perl\site\lib\AnyEvent\TLS.pm
Installing G:\perl\perl\site\lib\AnyEvent\Util.pm
Installing G:\perl\perl\site\lib\AnyEvent\Impl\Cocoa.pm
Installing G:\perl\perl\site\lib\AnyEvent\Impl\EV.pm
Installing G:\perl\perl\site\lib\AnyEvent\Impl\Event.pm
Installing G:\perl\perl\site\lib\AnyEvent\Impl\EventLib.pm
Installing G:\perl\perl\site\lib\AnyEvent\Impl\FLTK.pm
Installing G:\perl\perl\site\lib\AnyEvent\Impl\Glib.pm
Installing G:\perl\perl\site\lib\AnyEvent\Impl\IOAsync.pm
Installing G:\perl\perl\site\lib\AnyEvent\Impl\Irssi.pm
Installing G:\perl\perl\site\lib\AnyEvent\Impl\Perl.pm
Installing G:\perl\perl\site\lib\AnyEvent\Impl\POE.pm
Installing G:\perl\perl\site\lib\AnyEvent\Impl\Qt.pm
Installing G:\perl\perl\site\lib\AnyEvent\Impl\Tk.pm
Installing G:\perl\perl\site\lib\AnyEvent\IO\IOAIO.pm
Installing G:\perl\perl\site\lib\AnyEvent\IO\Perl.pm
Installing G:\perl\perl\site\lib\AnyEvent\Util\idna.pl
Installing G:\perl\perl\site\lib\AnyEvent\Util\uts46data.pl
Appending installation info to G:\perl\perl\lib/perllocal.pod
MLEHMANN/AnyEvent-7.07.tar.gz
G:\perl\c\bin\dmake.exe install UNINST=1 -- OK
Running install for module 'XML::Atom::Feed'
Running make for M/MI/MIYAGAWA/XML-Atom-0.41.tar.gz
Fetching with LWP:
http://cpan.strawberryperl.com/authors/id/M/MI/MIYAGAWA/XML-Atom-0.41.tar.gz
Checksum for G:\perl\cpan\sources\authors\id\M\MI\MIYAGAWA\XML-Atom-0.41.tar.gz ok

CPAN.pm: Building M/MI/MIYAGAWA/XML-Atom-0.41.tar.gz

Checking if your kit is complete...
Looks good
Warning: prerequisite XML::XPath 0 not found.
Generating a dmake-style Makefile
Writing Makefile for XML::Atom
Writing MYMETA.yml and MYMETA.json
---- Unsatisfied dependencies detected during ----
---- MIYAGAWA/XML-Atom-0.41.tar.gz ----
XML::XPath [requires]
Running make test
Delayed until after prerequisites
Running make install
Delayed until after prerequisites
Running install for module 'XML::XPath'
Running make for M/MS/MSERGEANT/XML-XPath-1.13.tar.gz
Fetching with LWP:
http://cpan.strawberryperl.com/authors/id/M/MS/MSERGEANT/XML-XPath-1.13.tar.gz
Fetching with LWP:
http://cpan.strawberryperl.com/authors/id/M/MS/MSERGEANT/CHECKSUMS
Checksum for G:\perl\cpan\sources\authors\id\M\MS\MSERGEANT\XML-XPath-1.13.tar.gz ok

CPAN.pm: Building M/MS/MSERGEANT/XML-XPath-1.13.tar.gz

Checking if your kit is complete...
Looks good
Generating a dmake-style Makefile
Writing Makefile for XML::XPath
Writing MYMETA.yml and MYMETA.json
cp XPath/NodeSet.pm blib\lib\XML\XPath\NodeSet.pm
cp XPath/Node/Attribute.pm blib\lib\XML\XPath\Node\Attribute.pm
cp XPath/Variable.pm blib\lib\XML\XPath\Variable.pm
cp XPath/Step.pm blib\lib\XML\XPath\Step.pm
cp XPath/Function.pm blib\lib\XML\XPath\Function.pm
cp XPath/Node/Text.pm blib\lib\XML\XPath\Node\Text.pm
cp XPath/Node/PI.pm blib\lib\XML\XPath\Node\PI.pm
cp XPath/XMLParser.pm blib\lib\XML\XPath\XMLParser.pm
cp XPath/Number.pm blib\lib\XML\XPath\Number.pm
cp XPath/Node.pm blib\lib\XML\XPath\Node.pm
cp XPath/PerlSAX.pm blib\lib\XML\XPath\PerlSAX.pm
cp XPath/Boolean.pm blib\lib\XML\XPath\Boolean.pm
cp XPath/Node/Element.pm blib\lib\XML\XPath\Node\Element.pm
cp XPath/Parser.pm blib\lib\XML\XPath\Parser.pm
cp XPath.pm blib\lib\XML\XPath.pm
cp XPath/LocationPath.pm blib\lib\XML\XPath\LocationPath.pm
cp XPath/Literal.pm blib\lib\XML\XPath\Literal.pm
cp XPath/Node/Comment.pm blib\lib\XML\XPath\Node\Comment.pm
cp XPath/Builder.pm blib\lib\XML\XPath\Builder.pm
cp XPath/Node/Namespace.pm blib\lib\XML\XPath\Node\Namespace.pm
cp XPath/Root.pm blib\lib\XML\XPath\Root.pm
cp XPath/Expr.pm blib\lib\XML\XPath\Expr.pm
"G:\perl\perl\bin\perl.exe" -MExtUtils::Command -e cp -- examples/xpath blib\script\xpath
pl2bat.bat blib\script\xpath
MSERGEANT/XML-XPath-1.13.tar.gz
G:\perl\c\bin\dmake.exe -- OK
Running make test
"G:\perl\perl\bin\perl.exe" "-MExtUtils::Command::MM" "-MTest::Harness" "-e" "undef *Test::Harness::Switches; test_harne
ss(0, 'blib\lib', 'blib\arch')" t/*.t
t/01basic.t ................ ok
t/02descendant.t ........... ok
t/03star.t ................. ok
t/04pos.t .................. ok
t/05attrib.t ............... ok
t/06attrib_val.t ........... ok
t/07count.t ................ ok
t/08name.t ................. ok
t/09a_string_length.t ...... ok
t/09string_length.t ........ ok
t/10pipe.t ................. ok
t/11axischild.t ............ ok
t/12axisdescendant.t ....... ok
t/13axisparent.t ........... ok
t/14axisancestor.t ......... ok
t/15axisfol_sib.t .......... ok
t/16axisprec_sib.t ......... ok
t/17axisfollowing.t ........ ok
t/18axispreceding.t ........ ok
t/19axisd_or_s.t ........... ok
t/20axisa_or_s.t ........... ok
t/21allnodes.t ............. ok
t/22name_select.t .......... ok
t/23func.t ................. ok
t/24namespaces.t ........... ok
t/25scope.t ................ ok
t/26predicate.t ............ ok
t/27asxml.t ................ ok
t/28ancestor2.t ............ ok
t/29desc_with_predicate.t .. ok
t/30lang.t ................. ok
t/insert.t ................. ok
t/rdf.t .................... ok
t/remove.t ................. ok
t/stress.t ................. ok
All tests successful.
Files=35, Tests=187, 6 wallclock secs ( 0.19 usr + 0.09 sys = 0.28 CPU)
Result: PASS
MSERGEANT/XML-XPath-1.13.tar.gz
G:\perl\c\bin\dmake.exe test -- OK
Running make install
Installing G:\perl\perl\site\lib\XML\XPath.pm
Installing G:\perl\perl\site\lib\XML\XPath\Boolean.pm
Installing G:\perl\perl\site\lib\XML\XPath\Builder.pm
Installing G:\perl\perl\site\lib\XML\XPath\Expr.pm
Installing G:\perl\perl\site\lib\XML\XPath\Function.pm
Installing G:\perl\perl\site\lib\XML\XPath\Literal.pm
Installing G:\perl\perl\site\lib\XML\XPath\LocationPath.pm
Installing G:\perl\perl\site\lib\XML\XPath\Node.pm
Installing G:\perl\perl\site\lib\XML\XPath\NodeSet.pm
Installing G:\perl\perl\site\lib\XML\XPath\Number.pm
Installing G:\perl\perl\site\lib\XML\XPath\Parser.pm
Installing G:\perl\perl\site\lib\XML\XPath\PerlSAX.pm
Installing G:\perl\perl\site\lib\XML\XPath\Root.pm
Installing G:\perl\perl\site\lib\XML\XPath\Step.pm
Installing G:\perl\perl\site\lib\XML\XPath\Variable.pm
Installing G:\perl\perl\site\lib\XML\XPath\XMLParser.pm
Installing G:\perl\perl\site\lib\XML\XPath\Node\Attribute.pm
Installing G:\perl\perl\site\lib\XML\XPath\Node\Comment.pm
Installing G:\perl\perl\site\lib\XML\XPath\Node\Element.pm
Installing G:\perl\perl\site\lib\XML\XPath\Node\Namespace.pm
Installing G:\perl\perl\site\lib\XML\XPath\Node\PI.pm
Installing G:\perl\perl\site\lib\XML\XPath\Node\Text.pm
Installing G:\perl\perl\site\bin\xpath
Installing G:\perl\perl\site\bin\xpath.bat
Appending installation info to G:\perl\perl\lib/perllocal.pod
MSERGEANT/XML-XPath-1.13.tar.gz
G:\perl\c\bin\dmake.exe install UNINST=1 -- OK
Running make for M/MI/MIYAGAWA/XML-Atom-0.41.tar.gz
Has already been unwrapped into directory G:\perl\cpan\build\XML-Atom-0.41-SdpQdv

CPAN.pm: Building M/MI/MIYAGAWA/XML-Atom-0.41.tar.gz

cp lib/XML/Atom.pm blib\lib\XML\Atom.pm
cp lib/XML/Atom/Util.pm blib\lib\XML\Atom\Util.pm
cp lib/XML/Atom/Thing.pm blib\lib\XML\Atom\Thing.pm
cp lib/XML/Atom/Content.pm blib\lib\XML\Atom\Content.pm
cp lib/XML/Atom/Server.pm blib\lib\XML\Atom\Server.pm
cp lib/XML/Atom/Entry.pm blib\lib\XML\Atom\Entry.pm
cp lib/XML/Atom/Client.pm blib\lib\XML\Atom\Client.pm
cp lib/XML/Atom/ErrorHandler.pm blib\lib\XML\Atom\ErrorHandler.pm
cp lib/XML/Atom/Base.pm blib\lib\XML\Atom\Base.pm
cp lib/XML/Atom/Person.pm blib\lib\XML\Atom\Person.pm
cp lib/XML/Atom/Category.pm blib\lib\XML\Atom\Category.pm
cp lib/XML/Atom/Link.pm blib\lib\XML\Atom\Link.pm
cp lib/XML/Atom/Feed.pm blib\lib\XML\Atom\Feed.pm
MIYAGAWA/XML-Atom-0.41.tar.gz
G:\perl\c\bin\dmake.exe -- OK
Running make test
"G:\perl\perl\bin\perl.exe" "-MExtUtils::Command::MM" "-MTest::Harness" "-e" "undef *Test::Harness::Switches; test_harne
ss(0, 'inc', 'blib\lib', 'blib\arch')" t/*.t
t/00-compile.t ................... ok
t/01-util.t ...................... ok
t/02-content.t ................... ok
t/03-link.t ...................... ok
t/04-person.t .................... ok
t/11-entry.t ..................... ok
t/12-feed.t ...................... ok
t/13-atom1.t ..................... ok
t/14-atom1-create.t .............. ok
t/15-content-image.t ............. ok
t/16-content-binary.t ............ ok
t/17-renames.t ................... ok
t/18-unicode.t ................... Use of the encoding pragma is deprecated at t/18-unicode.t line 4.
t/18-unicode.t ................... skipped: Skipping Unicode test since it depends on LibXML
t/19-ext.t ....................... ok
t/20-content-xhtml.t ............. ok
t/23-category.t .................. ok
t/24-bad-content.t ............... ok
t/25-utf8-create.t ............... ok
t/27-client-leaks.t .............. ok
t/28-ext.t ....................... ok
t/29-source.t .................... ok
t/30-datetime-stringification.t .. skipped: DateTime and DateTime::Format::Atom are required for tests
t/31-external-entities-libxml.t .. ok
t/31-external-entities-xpath.t ... # XPath Override in place
Constant subroutine XML::Atom::LIBXML redefined at t/31-external-entities-xpath.t line 18.
External Entities disabled. at G:\perl\cpan\build\XML-Atom-0.41-SdpQdv\blib\lib/XML/Atom.pm line 52.
t/31-external-entities-xpath.t ... ok
All tests successful.
Files=24, Tests=283, 10 wallclock secs ( 0.11 usr + 0.08 sys = 0.19 CPU)
Result: PASS
MIYAGAWA/XML-Atom-0.41.tar.gz
G:\perl\c\bin\dmake.exe test -- OK
Running make install
Installing G:\perl\perl\site\lib\XML\Atom.pm
Installing G:\perl\perl\site\lib\XML\Atom\Base.pm
Installing G:\perl\perl\site\lib\XML\Atom\Category.pm
Installing G:\perl\perl\site\lib\XML\Atom\Client.pm
Installing G:\perl\perl\site\lib\XML\Atom\Content.pm
Installing G:\perl\perl\site\lib\XML\Atom\Entry.pm
Installing G:\perl\perl\site\lib\XML\Atom\ErrorHandler.pm
Installing G:\perl\perl\site\lib\XML\Atom\Feed.pm
Installing G:\perl\perl\site\lib\XML\Atom\Link.pm
Installing G:\perl\perl\site\lib\XML\Atom\Person.pm
Installing G:\perl\perl\site\lib\XML\Atom\Server.pm
Installing G:\perl\perl\site\lib\XML\Atom\Thing.pm
Installing G:\perl\perl\site\lib\XML\Atom\Util.pm
Appending installation info to G:\perl\perl\lib/perllocal.pod
MIYAGAWA/XML-Atom-0.41.tar.gz
G:\perl\c\bin\dmake.exe install UNINST=1 -- OK
Running install for module 'AnyEvent::HTTP'
Running make for M/ML/MLEHMANN/AnyEvent-HTTP-2.21.tar.gz
Fetching with LWP:
http://cpan.strawberryperl.com/authors/id/M/ML/MLEHMANN/AnyEvent-HTTP-2.21.tar.gz
Fetching with LWP:
http://cpan.strawberryperl.com/authors/id/M/ML/MLEHMANN/CHECKSUMS
Checksum for G:\perl\cpan\sources\authors\id\M\ML\MLEHMANN\AnyEvent-HTTP-2.21.tar.gz ok

CPAN.pm: Building M/ML/MLEHMANN/AnyEvent-HTTP-2.21.tar.gz

Checking if your kit is complete...
Looks good
Generating a dmake-style Makefile
Writing Makefile for AnyEvent::HTTP
Writing MYMETA.yml and MYMETA.json
cp HTTP.pm blib\lib\AnyEvent\HTTP.pm
MLEHMANN/AnyEvent-HTTP-2.21.tar.gz
G:\perl\c\bin\dmake.exe -- OK
Running make test
"G:\perl\perl\bin\perl.exe" "-MExtUtils::Command::MM" "-MTest::Harness" "-e" "undef *Test::Harness::Switches; test_harne
ss(0, 'blib\lib', 'blib\arch')" t/*.t
t/00_load.t ... ok
t/01_basic.t .. ok
All tests successful.
Files=2, Tests=5, 0 wallclock secs ( 0.05 usr + 0.06 sys = 0.11 CPU)
Result: PASS
MLEHMANN/AnyEvent-HTTP-2.21.tar.gz
G:\perl\c\bin\dmake.exe test -- OK
Running make install
Installing G:\perl\perl\site\lib\AnyEvent\HTTP.pm
Appending installation info to G:\perl\perl\lib/perllocal.pod
MLEHMANN/AnyEvent-HTTP-2.21.tar.gz
G:\perl\c\bin\dmake.exe install UNINST=1 -- OK
Running make for S/SE/SEKIMURA/AnyEvent-Gmail-Feed-0.02.tar.gz
Has already been unwrapped into directory G:\perl\cpan\build\AnyEvent-Gmail-Feed-0.02-HDbODM

CPAN.pm: Building S/SE/SEKIMURA/AnyEvent-Gmail-Feed-0.02.tar.gz

cp lib/AnyEvent/Gmail/Feed.pm blib\lib\AnyEvent\Gmail\Feed.pm
SEKIMURA/AnyEvent-Gmail-Feed-0.02.tar.gz
G:\perl\c\bin\dmake.exe -- OK
Running make test
"G:\perl\perl\bin\perl.exe" "-MExtUtils::Command::MM" "-MTest::Harness" "-e" "undef *Test::Harness::Switches; test_harne
ss(0, 'inc', 'blib\lib', 'blib\arch')" t/*.t
t/00_compile.t .. ok
All tests successful.
Files=1, Tests=1, 1 wallclock secs ( 0.06 usr + 0.01 sys = 0.08 CPU)
Result: PASS
SEKIMURA/AnyEvent-Gmail-Feed-0.02.tar.gz
G:\perl\c\bin\dmake.exe test -- OK
Running make install
Installing G:\perl\perl\site\lib\AnyEvent\Gmail\Feed.pm
Appending installation info to G:\perl\perl\lib/perllocal.pod
SEKIMURA/AnyEvent-Gmail-Feed-0.02.tar.gz
G:\perl\c\bin\dmake.exe install UNINST=1 -- OK


Even though it installed for me, it may not work correctly ... note of the skipped tests where it states that my perl is broken (which it isn't) and that I should use cygwin. That tells me that the module needs a *nix environment to work correctly.


zak100
User

Nov 26, 2014, 8:40 AM

Post #20 of 44 (17689 views)
Re: [FishMonger] Automatic reply to email [In reply to] Can't Post

Hi,
I did not write the exact command. I mentioned this in post#12 also. This time I tried to capture some steps in different copy paste steps.

Code
C:\Apache\cgi-bin\dsd2014_74>cpan i /AnyEvent::GMail::Feed/ 
CPAN: Term::ANSIColor loaded ok (v4.02)
CPAN: Storable loaded ok (v2.34)
Reading 'C:\Perl64\cpan\Metadata'
Database was generated on Tue, 25 Nov 2014 10:41:02 GMT
Warning: Cannot install i, don't know what it is.
Try the command

i /i/

to find objects with matching identifiers.
CPAN: Time::HiRes loaded ok (v1.9725)
Running install for module 'AnyEvent::Gmail::Feed'
Running make for S/SE/SEKIMURA/AnyEvent-Gmail-Feed-0.02.tar.gz
CPAN: Digest::SHA loaded ok (v5.84)
CPAN: Compress::Zlib loaded ok (v2.06)
Checksum for C:\Perl64\cpan\sources\authors\id\S\SE\SEKIMURA\AnyEvent-Gmail-Feed
-0.02.tar.gz ok
CPAN: Archive::Tar loaded ok (v1.90)
AnyEvent-Gmail-Feed-0.02/
AnyEvent-Gmail-Feed-0.02/.gitignore
AnyEvent-Gmail-Feed-0.02/Changes
AnyEvent-Gmail-Feed-0.02/example/
AnyEvent-Gmail-Feed-0.02/example/gmail-notifier
AnyEvent-Gmail-Feed-0.02/inc/
AnyEvent-Gmail-Feed-0.02/inc/Module/
AnyEvent-Gmail-Feed-0.02/inc/Module/Install/
AnyEvent-Gmail-Feed-0.02/inc/Module/Install/AuthorTests.pm
AnyEvent-Gmail-Feed-0.02/inc/Module/Install/Base.pm
AnyEvent-Gmail-Feed-0.02/inc/Module/Install/Can.pm
AnyEvent-Gmail-Feed-0.02/inc/Module/Install/Fetch.pm
AnyEvent-Gmail-Feed-0.02/inc/Module/Install/Include.pm
AnyEvent-Gmail-Feed-0.02/inc/Module/Install/Makefile.pm
AnyEvent-Gmail-Feed-0.02/inc/Module/Install/Metadata.pm
AnyEvent-Gmail-Feed-0.02/inc/Module/Install/TestBase.pm
AnyEvent-Gmail-Feed-0.02/inc/Module/Install/Win32.pm
AnyEvent-Gmail-Feed-0.02/inc/Module/Install/WriteAll.pm
AnyEvent-Gmail-Feed-0.02/inc/Module/Install.pm
AnyEvent-Gmail-Feed-0.02/inc/Spiffy.pm
AnyEvent-Gmail-Feed-0.02/inc/Test/
AnyEvent-Gmail-Feed-0.02/inc/Test/Base/
AnyEvent-Gmail-Feed-0.02/inc/Test/Base/Filter.pm
AnyEvent-Gmail-Feed-0.02/inc/Test/Base.pm
AnyEvent-Gmail-Feed-0.02/inc/Test/Builder/
AnyEvent-Gmail-Feed-0.02/inc/Test/Builder/Module.pm
AnyEvent-Gmail-Feed-0.02/inc/Test/Builder.pm
AnyEvent-Gmail-Feed-0.02/inc/Test/More.pm
AnyEvent-Gmail-Feed-0.02/lib/
AnyEvent-Gmail-Feed-0.02/lib/AnyEvent/
AnyEvent-Gmail-Feed-0.02/lib/AnyEvent/Gmail/
AnyEvent-Gmail-Feed-0.02/lib/AnyEvent/Gmail/Feed.pm
AnyEvent-Gmail-Feed-0.02/Makefile.PL
AnyEvent-Gmail-Feed-0.02/MANIFEST
AnyEvent-Gmail-Feed-0.02/META.yml
AnyEvent-Gmail-Feed-0.02/README
AnyEvent-Gmail-Feed-0.02/t/
AnyEvent-Gmail-Feed-0.02/t/00_compile.t
AnyEvent-Gmail-Feed-0.02/xt/
AnyEvent-Gmail-Feed-0.02/xt/perlcritic.t
AnyEvent-Gmail-Feed-0.02/xt/pod.t
AnyEvent-Gmail-Feed-0.02/xt/podspell.t
CPAN: File::Temp loaded ok (v0.22)
CPAN: Parse::CPAN::Meta loaded ok (v1.4404)
CPAN: CPAN::Meta loaded ok (v2.120921)

CPAN.pm: Building S/SE/SEKIMURA/AnyEvent-Gmail-Feed-0.02.tar.gz

Checking if your kit is complete...
Looks good
Warning: prerequisite XML::Atom::Feed 0 not found.
Writing Makefile for AnyEvent::Gmail::Feed
Writing MYMETA.yml and MYMETA.json
CPAN: Module::CoreList loaded ok (v2.80)
---- Unsatisfied dependencies detected during ----
---- SEKIMURA/AnyEvent-Gmail-Feed-0.02.tar.gz ----
XML::Atom::Feed [requires]
Running make test
Delayed until after prerequisites
Running make install
Delayed until after prerequisites
Running install for module 'XML::Atom::Feed'
Running make for M/MI/MIYAGAWA/XML-Atom-0.41.tar.gz
Checksum for C:\Perl64\cpan\sources\authors\id\M\MI\MIYAGAWA\XML-Atom-0.41.tar.g
z ok




Could not make: cannot resolve circular dependency
Running Build test
Can't test without successful make
Running Build install
Make had returned bad status, install seems impossible
Running install for module 'DateTime::TimeZone'
Running make for D/DR/DROLSKY/DateTime-TimeZone-1.81.tar.gz
Has already been unwrapped into directory C:\Perl64\cpan\build\DateTime-TimeZo
ne-1.81-YcNJ6p
Could not make: cannot resolve circular dependency
Running make test
Can't test without successful make
Running make install
Make had returned bad status, install seems impossible
Running install for module 'XML::LibXML'
Running make for S/SH/SHLOMIF/XML-LibXML-2.0117.tar.gz
Checksum for C:\Perl64\cpan\sources\authors\id\S\SH\SHLOMIF\XML-LibXML-2.0117.ta
r.gz ok
XML-LibXML-2.0117/
XML-LibXML-2.0117/perl-libxml-mm.h
XML-LibXML-2.0117/TODO
XML-LibXML-2.0117/Changes
XML-LibXML-2.0117/lib/
XML-LibXML-2.0117/lib/XML/
XML-LibXML-2.0117/lib/XML/LibXML/
XML-LibXML-2.0117/lib/XML/LibXML/CDATASection.pod
XML-LibXML-2.0117/lib/XML/LibXML/Document.pod
XML-LibXML-2.0117/lib/XML/LibXML/PI.pod
XML-LibXML-2.0117/lib/XML/LibXML/Common.pod
XML-LibXML-2.0117/lib/XML/LibXML/InputCallback.pod
XML-LibXML-2.0117/lib/XML/LibXML/Literal.pm
XML-LibXML-2.0117/lib/XML/LibXML/XPathExpression.pod
XML-LibXML-2.0117/lib/XML/LibXML/SAX.pm
XML-LibXML-2.0117/lib/XML/LibXML/NodeList.pm
XML-LibXML-2.0117/lib/XML/LibXML/Schema.pod
XML-LibXML-2.0117/lib/XML/LibXML/Error.pm
XML-LibXML-2.0117/lib/XML/LibXML/Text.pod
XML-LibXML-2.0117/lib/XML/LibXML/ErrNo.pod
XML-LibXML-2.0117/lib/XML/LibXML/Pattern.pod
XML-LibXML-2.0117/lib/XML/LibXML/Dtd.pod
XML-LibXML-2.0117/lib/XML/LibXML/DocumentFragment.pod
XML-LibXML-2.0117/lib/XML/LibXML/RelaxNG.pod
XML-LibXML-2.0117/lib/XML/LibXML/XPathContext.pod
XML-LibXML-2.0117/lib/XML/LibXML/Boolean.pm
XML-LibXML-2.0117/lib/XML/LibXML/Devel.pm
XML-LibXML-2.0117/lib/XML/LibXML/Number.pm
XML-LibXML-2.0117/lib/XML/LibXML/Reader.pod
XML-LibXML-2.0117/lib/XML/LibXML/Error.pod
XML-LibXML-2.0117/lib/XML/LibXML/XPathContext.pm
XML-LibXML-2.0117/lib/XML/LibXML/SAX.pod
XML-LibXML-2.0117/lib/XML/LibXML/Reader.pm
XML-LibXML-2.0117/lib/XML/LibXML/Common.pm
XML-LibXML-2.0117/lib/XML/LibXML/Node.pod
XML-LibXML-2.0117/lib/XML/LibXML/Element.pod
XML-LibXML-2.0117/lib/XML/LibXML/SAX/
XML-LibXML-2.0117/lib/XML/LibXML/SAX/Generator.pm
XML-LibXML-2.0117/lib/XML/LibXML/SAX/Parser.pm
XML-LibXML-2.0117/lib/XML/LibXML/SAX/Builder.pm
XML-LibXML-2.0117/lib/XML/LibXML/SAX/Builder.pod
XML-LibXML-2.0117/lib/XML/LibXML/AttributeHash.pm
XML-LibXML-2.0117/lib/XML/LibXML/RegExp.pod
XML-LibXML-2.0117/lib/XML/LibXML/Parser.pod
XML-LibXML-2.0117/lib/XML/LibXML/ErrNo.pm
XML-LibXML-2.0117/lib/XML/LibXML/Attr.pod
XML-LibXML-2.0117/lib/XML/LibXML/Namespace.pod
XML-LibXML-2.0117/lib/XML/LibXML/Comment.pod
XML-LibXML-2.0117/lib/XML/LibXML/DOM.pod
XML-LibXML-2.0117/LICENSE
XML-LibXML-2.0117/MANIFEST
XML-LibXML-2.0117/xpath.h
XML-LibXML-2.0117/inc/
XML-LibXML-2.0117/inc/Devel/
XML-LibXML-2.0117/inc/Devel/CheckLib.pm
XML-LibXML-2.0117/example/
XML-LibXML-2.0117/example/test3.xml
XML-LibXML-2.0117/example/JBR-ALLENtrees.htm
XML-LibXML-2.0117/example/article_internal.xml
XML-LibXML-2.0117/example/dtd.xml
XML-LibXML-2.0117/example/xmlns/
XML-LibXML-2.0117/example/xmlns/goodguy.xml
XML-LibXML-2.0117/example/xmlns/badguy.xml
XML-LibXML-2.0117/example/cb_example.pl
XML-LibXML-2.0117/example/utf-16-1.html
XML-LibXML-2.0117/example/test.dtd
XML-LibXML-2.0117/example/test4.xml
XML-LibXML-2.0117/example/ext_ent.dtd
XML-LibXML-2.0117/example/article_external_bad.xml
XML-LibXML-2.0117/example/enc_latin2.html
XML-LibXML-2.0117/example/xpath.pl
XML-LibXML-2.0117/example/test.html
XML-LibXML-2.0117/example/article.xml
XML-LibXML-2.0117/example/article_internal_bad.xml
XML-LibXML-2.0117/example/catalog.xml
XML-LibXML-2.0117/example/bad.xml
XML-LibXML-2.0117/example/utf-16-2.xml
XML-LibXML-2.0117/example/test.xml
XML-LibXML-2.0117/example/test2.xml
XML-LibXML-2.0117/example/dromeds.xml
XML-LibXML-2.0117/example/enc2_latin2.html
XML-LibXML-2.0117/example/yahoo-finance-html-with-errors.html
XML-LibXML-2.0117/example/article_bad.xml
XML-LibXML-2.0117/example/complex/
XML-LibXML-2.0117/example/complex/complex.dtd
XML-LibXML-2.0117/example/complex/dtd/
XML-LibXML-2.0117/example/complex/dtd/g.dtd
XML-LibXML-2.0117/example/complex/dtd/f.dtd
XML-LibXML-2.0117/example/complex/complex.xml
XML-LibXML-2.0117/example/complex/complex2.xml
XML-LibXML-2.0117/example/thedieline.rss
XML-LibXML-2.0117/example/test.xhtml
XML-LibXML-2.0117/example/xmllibxmldocs.pl
XML-LibXML-2.0117/example/ns.xml
XML-LibXML-2.0117/example/bad.dtd
XML-LibXML-2.0117/example/utf-16-2.html
XML-LibXML-2.0117/LibXML.pm
XML-LibXML-2.0117/Av_CharPtrPtr.h
XML-LibXML-2.0117/LibXML.pod
XML-LibXML-2.0117/Makefile.PL
XML-LibXML-2.0117/docs/
XML-LibXML-2.0117/docs/libxml.dbk
XML-LibXML-2.0117/META.yml
XML-LibXML-2.0117/Av_CharPtrPtr.c
XML-LibXML-2.0117/test/
XML-LibXML-2.0117/test/schema/
XML-LibXML-2.0117/test/schema/demo.xml
XML-LibXML-2.0117/test/schema/badschema.xsd
XML-LibXML-2.0117/test/schema/invaliddemo.xml
XML-LibXML-2.0117/test/schema/schema.xsd
XML-LibXML-2.0117/test/xinclude/
XML-LibXML-2.0117/test/xinclude/entity.txt
XML-LibXML-2.0117/test/xinclude/xinclude.xml
XML-LibXML-2.0117/test/xinclude/test.xml
XML-LibXML-2.0117/test/textReader/
XML-LibXML-2.0117/test/textReader/countries.xml
XML-LibXML-2.0117/test/relaxng/
XML-LibXML-2.0117/test/relaxng/demo4.rng
XML-LibXML-2.0117/test/relaxng/demo.xml
XML-LibXML-2.0117/test/relaxng/demo3.rng
XML-LibXML-2.0117/test/relaxng/badschema.rng
XML-LibXML-2.0117/test/relaxng/invaliddemo.xml
XML-LibXML-2.0117/test/relaxng/schema.rng
XML-LibXML-2.0117/test/relaxng/demo2.rng
XML-LibXML-2.0117/test/relaxng/demo.rng
XML-LibXML-2.0117/META.json
XML-LibXML-2.0117/perl-libxml-sax.h
XML-LibXML-2.0117/Devel.xs
XML-LibXML-2.0117/README
XML-LibXML-2.0117/t/
XML-LibXML-2.0117/t/48_memleak_rt_83744.t
XML-LibXML-2.0117/t/90stack.t
XML-LibXML-2.0117/t/60struct_error.t
XML-LibXML-2.0117/t/90threads.t
XML-LibXML-2.0117/t/25relaxng.t
XML-LibXML-2.0117/t/90shared_clone_failed_rt_91800.t
XML-LibXML-2.0117/t/72destruction.t
XML-LibXML-2.0117/t/48_RH5_double_free_rt83779.t
XML-LibXML-2.0117/t/29id.t
XML-LibXML-2.0117/t/09xpath.t
XML-LibXML-2.0117/t/lib/
XML-LibXML-2.0117/t/lib/Stacker.pm
XML-LibXML-2.0117/t/lib/Counter.pm
XML-LibXML-2.0117/t/lib/Collector.pm
XML-LibXML-2.0117/t/lib/TestHelpers.pm
XML-LibXML-2.0117/t/19encoding.t
XML-LibXML-2.0117/t/style-trailing-space.t
XML-LibXML-2.0117/t/41xinclude.t
XML-LibXML-2.0117/t/46err_column.t
XML-LibXML-2.0117/t/49callbacks_returning_undef.t
XML-LibXML-2.0117/t/80registryleak.t
XML-LibXML-2.0117/t/23rawfunctions.t
XML-LibXML-2.0117/t/06elements.t
XML-LibXML-2.0117/t/61error.t
XML-LibXML-2.0117/t/27new_callbacks_simple.t
XML-LibXML-2.0117/t/42common.t
XML-LibXML-2.0117/t/62overload.t
XML-LibXML-2.0117/t/48_replaceNode_DTD_nodes_rT_80521.t
XML-LibXML-2.0117/t/28new_callbacks_multiple.t
XML-LibXML-2.0117/t/03doc.t
XML-LibXML-2.0117/t/60error_prev_chain.t
XML-LibXML-2.0117/t/40reader.t
XML-LibXML-2.0117/t/31xpc_functions.t
XML-LibXML-2.0117/t/48_removeChild_crashes_rt_80395.t
XML-LibXML-2.0117/t/43options.t
XML-LibXML-2.0117/t/48_rt55000.t
XML-LibXML-2.0117/t/cpan-changes.t
XML-LibXML-2.0117/t/05text.t
XML-LibXML-2.0117/t/10ns.t
XML-LibXML-2.0117/t/12html.t
XML-LibXML-2.0117/t/48_SAX_Builder_rt_91433.t
XML-LibXML-2.0117/t/48_rt93429_recover_2_in_html_parsing.t
XML-LibXML-2.0117/t/17callbacks.t
XML-LibXML-2.0117/t/48importing_nodes_IDs_rt_69520.t
XML-LibXML-2.0117/t/21catalog.t
XML-LibXML-2.0117/t/30keep_blanks.t
XML-LibXML-2.0117/t/20extras.t
XML-LibXML-2.0117/t/26schema.t
XML-LibXML-2.0117/t/pod.t
XML-LibXML-2.0117/t/47load_xml_callbacks.t
XML-LibXML-2.0117/t/13dtd.t
XML-LibXML-2.0117/t/35huge_mode.t
XML-LibXML-2.0117/t/71overloads.t
XML-LibXML-2.0117/t/data/
XML-LibXML-2.0117/t/data/callbacks_returning_undef.xml
XML-LibXML-2.0117/t/data/chinese.xml
XML-LibXML-2.0117/t/07dtd.t
XML-LibXML-2.0117/t/49global_extent.t
XML-LibXML-2.0117/t/40reader_mem_error.t
XML-LibXML-2.0117/t/04node.t
XML-LibXML-2.0117/t/24c14n.t
XML-LibXML-2.0117/t/14sax.t
XML-LibXML-2.0117/t/44extent.t
XML-LibXML-2.0117/t/45regex.t
XML-LibXML-2.0117/t/11memory.t
XML-LibXML-2.0117/t/01basic.t
XML-LibXML-2.0117/t/50devel.t
XML-LibXML-2.0117/t/18docfree.t
XML-LibXML-2.0117/t/08findnodes.t
XML-LibXML-2.0117/t/19die_on_invalid_utf8_rt_58848.t
XML-LibXML-2.0117/t/49_load_html.t
XML-LibXML-2.0117/t/02parse.t
XML-LibXML-2.0117/t/15nodelist.t
XML-LibXML-2.0117/t/16docnodes.t
XML-LibXML-2.0117/t/51_parse_html_string_rt87089.t
XML-LibXML-2.0117/t/91unique_key.t
XML-LibXML-2.0117/t/30xpathcontext.t
XML-LibXML-2.0117/t/32xpc_variables.t
XML-LibXML-2.0117/perl-libxml-sax.c
XML-LibXML-2.0117/debian/
XML-LibXML-2.0117/debian/changelog
XML-LibXML-2.0117/debian/libxml-libxml-perl.install
XML-LibXML-2.0117/debian/libxml-libxml-perl.postinst
XML-LibXML-2.0117/debian/libxml-libxml-perl.examples
XML-LibXML-2.0117/debian/libxml-libxml-perl.prerm
XML-LibXML-2.0117/debian/copyright
XML-LibXML-2.0117/debian/compat
XML-LibXML-2.0117/debian/libxml-libxml-perl.docs
XML-LibXML-2.0117/debian/control
XML-LibXML-2.0117/debian/rules
XML-LibXML-2.0117/typemap
XML-LibXML-2.0117/scripts/
XML-LibXML-2.0117/scripts/bump-version-number.pl
XML-LibXML-2.0117/scripts/tag-release.pl
XML-LibXML-2.0117/scripts/fast-eumm.pl
XML-LibXML-2.0117/scripts/update-HACKING-file.bash
XML-LibXML-2.0117/scripts/prints-to-comments.pl
XML-LibXML-2.0117/scripts/Test.pm-to-Test-More.pl
XML-LibXML-2.0117/LibXML.xs
XML-LibXML-2.0117/ppport.h
XML-LibXML-2.0117/xpath.c
XML-LibXML-2.0117/dom.c
XML-LibXML-2.0117/HACKING.txt
XML-LibXML-2.0117/perl-libxml-mm.c
XML-LibXML-2.0117/xpathcontext.h
XML-LibXML-2.0117/dom.h

CPAN.pm: Building S/SH/SHLOMIF/XML-LibXML-2.0117.tar.gz

enable native perl UTF8
Checking for ability to link against xml2...no
Checking for ability to link against libxml2...libxml2, zlib, and/or the Math li
brary (-lm) have not been found.
Try setting LIBS and INC values on the command line
Or get libxml2 from
http://xmlsoft.org/
If you install via RPMs, make sure you also install the -devel
RPMs, as this is where the headers (.h files) are.

Also, you may try to run perl Makefile.PL with the DEBUG=1 parameter
to see the exact reason why the detection of libxml2 installation
failed or why Makefile.PL was not able to compile a test program.
No 'Makefile' created SHLOMIF/XML-LibXML-2.0117.tar.gz
C:\Perl64\bin\perl.exe Makefile.PL INSTALLDIRS=site -- NOT OK
Running make test
Make had some problems, won't test
Running make install
Make had some problems, won't install
Running make for M/MI/MIYAGAWA/XML-Atom-0.41.tar.gz
Has already been unwrapped into directory C:\Perl64\cpan\build\XML-Atom-0.41-6
j5ava

CPAN.pm: Building M/MI/MIYAGAWA/XML-Atom-0.41.tar.gz

Warning: Prerequisite 'DateTime => 0' for 'MIYAGAWA/XML-Atom-0.41.tar.gz' failed
when processing 'DROLSKY/DateTime-1.12.tar.gz' with 'make => NO cannot resolve
circular dependency'. Continuing, but chances to succeed are limited.
Warning: Prerequisite 'DateTime::TimeZone => 0' for 'MIYAGAWA/XML-Atom-0.41.tar.
gz' failed when processing 'DROLSKY/DateTime-TimeZone-1.81.tar.gz' with 'make =>
NO cannot resolve circular dependency'. Continuing, but chances to succeed are
limited.
Warning: Prerequisite 'XML::LibXML => 1.69' for 'MIYAGAWA/XML-Atom-0.41.tar.gz'
failed when processing 'SHLOMIF/XML-LibXML-2.0117.tar.gz' with 'writemakefile =>
NO -- No 'Makefile' created
'. Continuing, but chances to succeed are limited.

Microsoft (R) Program Maintenance Utility Version 6.00.8168.0
Copyright (C) Microsoft Corp 1988-1998. All rights reserved.
NO -- No 'Makefile' created
'. Continuing, but chances to succeed are limited.

Microsoft (R) Program Maintenance Utility Version 6.00.8168.0
Copyright (C) Microsoft Corp 1988-1998. All rights reserved.

cp lib/XML/Atom/Entry.pm blib\lib\XML\Atom\Entry.pm
cp lib/XML/Atom/Person.pm blib\lib\XML\Atom\Person.pm
cp lib/XML/Atom/ErrorHandler.pm blib\lib\XML\Atom\ErrorHandler.pm
cp lib/XML/Atom/Category.pm blib\lib\XML\Atom\Category.pm
cp lib/XML/Atom/Link.pm blib\lib\XML\Atom\Link.pm
cp lib/XML/Atom/Server.pm blib\lib\XML\Atom\Server.pm
cp lib/XML/Atom.pm blib\lib\XML\Atom.pm
cp lib/XML/Atom/Util.pm blib\lib\XML\Atom\Util.pm
cp lib/XML/Atom/Thing.pm blib\lib\XML\Atom\Thing.pm
cp lib/XML/Atom/Feed.pm blib\lib\XML\Atom\Feed.pm
cp lib/XML/Atom/Content.pm blib\lib\XML\Atom\Content.pm
cp lib/XML/Atom/Client.pm blib\lib\XML\Atom\Client.pm
cp lib/XML/Atom/Base.pm blib\lib\XML\Atom\Base.pm
MIYAGAWA/XML-Atom-0.41.tar.gz
C:\PROGRA~2\MIB055~1\VC98\bin\nmake.exe -- OK
Running make test

Microsoft (R) Program Maintenance Utility Version 6.00.8168.0
Copyright (C) Microsoft Corp 1988-1998. All rights reserved.

C:\Perl64\bin\perl.exe "-MExtUtils::Command::MM" "-e" "test_harness(0, '
inc', 'blib\lib', 'blib\arch')" t/*.t
t/00-compile.t ................... ok
t/01-util.t ...................... skipped: DateTime is required for tests
t/02-content.t ................... ok
t/03-link.t ...................... ok
t/04-person.t .................... ok
t/11-entry.t ..................... 42/71
# Failed test at t/11-entry.t line 96.
# got: undef
# expected: 'Food & Drink'

# Failed test at t/11-entry.t line 104.
# got: undef
# expected: 'Food & Drink'

# Failed test at t/11-entry.t line 149.
# '<?xml version="1.0" encoding="UTF-8"?>
# <entry xmlns="http://purl.org/atom/ns#"><content xmlns="http://purl.org/atom/n
s#" mode="base64" type="image/gif">VGhpcyBpcyBhIHRlc3QgdGhhdCBzaG91bGQgdXNlIGJhc
2U2NAAu</content><link xmlns="http://purl.org/atom/ns#" xmlns:list="http://www.s
ixapart.com/atom/list#" title="Number Three" rel="service.post" href="http://www
.example.com/atom" type="application/x.atom+xml" list:type="Books" /><subject xm
lns:dc="http://purl.org/dc/elements/1.1/">Weblog</subject></entry>'
# doesn't match '(?^:<dc:subject .*>Weblog</dc:subject>)'

# Failed test at t/11-entry.t line 152.
# '<?xml version="1.0" encoding="UTF-8"?>
# <entry xmlns="http://purl.org/atom/ns#"><content xmlns="http://purl.org/atom/n
s#" mode="base64" type="image/gif">VGhpcyBpcyBhIHRlc3QgdGhhdCBzaG91bGQgdXNlIGJhc
2U2NAAu</content><link xmlns="http://purl.org/atom/ns#" xmlns:list="http://www.s
ixapart.com/atom/list#" title="Number Three" rel="service.post" href="http://www
.example.com/atom" type="application/x.atom+xml" list:type="Books" /><subject xm
lns:dc="http://purl.org/dc/elements/1.1/">Weblog</subject><subject xmlns:dc="htt
p://purl.org/dc/elements/1.1/">Tech</subject></entry>'
# doesn't match '(?^:<dc:subject .*>Weblog</dc:subject>)'

# Failed test at t/11-entry.t line 153.
# '<?xml version="1.0" encoding="UTF-8"?>
# <entry xmlns="http://purl.org/atom/ns#"><content xmlns="http://purl.org/atom/n
s#" mode="base64" type="image/gif">VGhpcyBpcyBhIHRlc3QgdGhhdCBzaG91bGQgdXNlIGJhc
2U2NAAu</content><link xmlns="http://purl.org/atom/ns#" xmlns:list="http://www.s
ixapart.com/atom/list#" title="Number Three" rel="service.post" href="http://www
.example.com/atom" type="application/x.atom+xml" list:type="Books" /><subject xm
lns:dc="http://purl.org/dc/elements/1.1/">Weblog</subject><subject xmlns:dc="htt
p://purl.org/dc/elements/1.1/">Tech</subject></entry>'
# doesn't match '(?^:<dc:subject .*>Tech</dc:subject>)'

# Failed test at t/11-entry.t line 157.
# '<?xml version="1.0" encoding="UTF-8"?>
# <entry xmlns="http://purl.org/atom/ns#"><content xmlns="http://purl.org/atom/n
s#" mode="base64" type="image/gif">VGhpcyBpcyBhIHRlc3QgdGhhdCBzaG91bGQgdXNlIGJhc
2U2NAAu</content><link xmlns="http://purl.org/atom/ns#" xmlns:list="http://www.s
ixapart.com/atom/list#" title="Number Three" rel="service.post" href="http://www
.example.com/atom" type="application/x.atom+xml" list:type="Books" /><subject xm
lns:dc="http://purl.org/dc/elements/1.1/">Weblog</subject><subject xmlns:dc="htt
p://purl.org/dc/elements/1.1/">Tech</subject><subject xmlns:dc="http://purl.org/
dc/elements/1.1/">Weblog</subject></entry>'
# doesn't match '(?^:<dc:subject .*>Weblog</dc:subject>)'
# Looks like you failed 6 tests of 71.
t/11-entry.t ..................... Dubious, test returned 6 (wstat 1536, 0x600)
Failed 6/71 subtests
(less 2 skipped subtests: 63 okay)
t/12-feed.t ...................... 1/33 Can't call method "get_global_pos" on an
undefined value at C:/Perl64/site/lib/XML/XPath/Node.pm line 412.
# Looks like you planned 33 tests but ran 29.
# Looks like your test exited with 255 just after 29.
t/12-feed.t ...................... Dubious, test returned 255 (wstat 65280, 0xff
00)
Failed 4/33 subtests
t/13-atom1.t ..................... 1/23
# Failed test 'atom:title'
# at t/13-atom1.t line 13.
# got: undef
# expected: 'dive into mark'

# Failed test 'atom:version based on namespace'
# at t/13-atom1.t line 14.
# got: '0.3'
# expected: '1.0'

# Failed test 'atom:updated'
# at t/13-atom1.t line 15.
# got: undef
# expected: '2005-07-11T12:29:29Z'

# Failed test '2 links'
# at t/13-atom1.t line 18.
# got: '0'
# expected: '2'
Can't call method "rel" on an undefined value at t/13-atom1.t line 53.
# Looks like you planned 23 tests but ran 5.
# Looks like you failed 4 tests of 5 run.
# Looks like your test exited with 255 just after 5.
t/13-atom1.t ..................... Dubious, test returned 255 (wstat 65280, 0xff
00)
Failed 22/23 subtests
t/14-atom1-create.t .............. ok
t/15-content-image.t ............. ok
t/16-content-binary.t ............ ok
t/17-renames.t ................... 1/5 Can't call method "modified" on an undefi
ned value at t/17-renames.t line 11.
# Looks like you planned 5 tests but ran 1.
# Looks like your test exited with 255 just after 1.
t/17-renames.t ................... Dubious, test returned 255 (wstat 65280, 0xff
00)
Failed 4/5 subtests
t/18-unicode.t ................... skipped: Skipping Unicode test since it depen
ds on LibXML
t/19-ext.t ....................... 1/16
# Failed test at t/19-ext.t line 35.
# '<?xml version="1.0" encoding="UTF-8"?>
# <with_ns xmlns="XML::Atom::Namespace=HASH(0x2ef5f08)" baz="1" />'
# doesn't match '(?^:<withns:with_ns.+xmlns:withns="http://example.com/withn
s/")'

# Failed test at t/19-ext.t line 38.
# '<?xml version="1.0" encoding="UTF-8"?>
# <feed xmlns="http://purl.org/atom/ns#"><foo xmlns="http://www.example.com/ns/"
><bar xmlns="http://www.example.com/ns/">1</bar></foo><foo2 xmlns="http://www.ex
ample.com/ns/"><bar xmlns="http://www.example.com/ns/">1</bar></foo2><with_ns xm
lns="XML::Atom::Namespace=HASH(0x2ef5f08)" baz="1" /></feed>'
# doesn't match '(?^:<withns:with_ns.+xmlns:withns="http://example.com/withn
s/")'
# Looks like you failed 2 tests of 16.
t/19-ext.t ....................... Dubious, test returned 2 (wstat 512, 0x200)
Failed 2/16 subtests
t/20-content-xhtml.t ............. ok
t/23-category.t ..................
t/23-category.t .................. 1/? # Failed test at t/23-category.t line 9
.
Can't call method "title" on an undefined value at t/23-category.t line 10.
# Looks like you failed 1 test of 1.
# Looks like your test exited with 255 just after 1.
t/23-category.t .................. Dubious, test returned 255 (wstat 65280, 0xff
00)
Failed 1/1 subtests
t/24-bad-content.t ............... ok
t/25-utf8-create.t ............... 1/?
# Failed test at t/25-utf8-create.t line 17.
# got: undef
# expected: 'Dicion&#9500;írios'
# Looks like you failed 1 test of 2.
t/25-utf8-create.t ............... Dubious, test returned 1 (wstat 256, 0x100)
Failed 1/2 subtests
t/27-client-leaks.t .............. skipped: DateTime is required for tests
t/28-ext.t ....................... 1/8
# Failed test 'extension accessors'
# at t/28-ext.t line 61.
# got: undef
# expected: '2'

# Failed test 'extension accessors'
# at t/28-ext.t line 61.
# got: undef
# expected: '2'

# Failed test 'extension accessors'
# at t/28-ext.t line 61.
# got: undef
# expected: '2'

# Failed test 'ext link match'
# at t/28-ext.t line 66.
# '<?xml version="1.0" encoding="UTF-8"?>
# <feed xmlns="http://purl.org/atom/ns#"><link xmlns="http://purl.org/atom/ns#"
href="http://www.legacy_link.com" /><link xmlns="XML::Atom::Namespace=HASH(0x2de
fc8)" href="http://www.extended_link.org" /><totalResults xmlns:testext="http://
test.com/-/spec/test/0.1/">2</totalResults><startIndex xmlns:testext="http://tes
t.com/-/spec/test/0.1/">2</startIndex><itemsPerPage xmlns:testext="http://test.c
om/-/spec/test/0.1/">2</itemsPerPage></feed>'
# doesn't match '(?^:<testext:link xmlns:testext="http://test.com/-/spec/tes
t/0.1/" href="http://www.extended_link.org"/>)'

# Failed test 'ext method match'
# at t/28-ext.t line 68.
# '<?xml version="1.0" encoding="UTF-8"?>
# <feed xmlns="http://purl.org/atom/ns#"><link xmlns="http://purl.org/atom/ns#"
href="http://www.legacy_link.com" /><link xmlns="XML::Atom::Namespace=HASH(0x2de
fc8)" href="http://www.extended_link.org" /><totalResults xmlns:testext="http://
test.com/-/spec/test/0.1/">2</totalResults><startIndex xmlns:testext="http://tes
t.com/-/spec/test/0.1/">2</startIndex><itemsPerPage xmlns:testext="http://test.c
om/-/spec/test/0.1/">2</itemsPerPage></feed>'
# doesn't match '(?^:<testext:startIndex xmlns:testext="http://test.com/-/sp
ec/test/0.1/">2</testext:startIndex>)'

# Failed test 'standard link match'
# at t/28-ext.t line 70.
# '<?xml version="1.0" encoding="UTF-8"?>
# <feed xmlns="http://purl.org/atom/ns#"><link xmlns="http://purl.org/atom/ns#"
href="http://www.legacy_link.com" /><link xmlns="XML::Atom::Namespace=HASH(0x2de
fc8)" href="http://www.extended_link.org" /><totalResults xmlns:testext="http://
test.com/-/spec/test/0.1/">2</totalResults><startIndex xmlns:testext="http://tes
t.com/-/spec/test/0.1/">2</startIndex><itemsPerPage xmlns:testext="http://test.c
om/-/spec/test/0.1/">2</itemsPerPage></feed>'
# doesn't match '(?^:<link(?: xmlns="http://purl.org/atom/ns#")? href="http:
//www.legacy_link.com"/>)'
# Looks like you failed 6 tests of 8.
t/28-ext.t ....................... Dubious, test returned 6 (wstat 1536, 0x600)
Failed 6/8 subtests
t/29-source.t ....................
t/29-source.t .................... 1/9 # Failed test at t/29-source.t line 9.
Can't call method "title" on an undefined value at t/29-source.t line 10.
# Looks like you planned 9 tests but ran 1.
# Looks like you failed 1 test of 1 run.
# Looks like your test exited with 255 just after 1.
t/29-source.t .................... Dubious, test returned 255 (wstat 65280, 0xff
00)
Failed 9/9 subtests
t/30-datetime-stringification.t .. skipped: DateTime and DateTime::Format::Atom
are required for tests
t/31-external-entities-libxml.t .. skipped: LibXML required for this test
t/31-external-entities-xpath.t ... External Entities disabled. at C:\Perl64\cpan
\build\XML-Atom-0.41-6j5ava\blib\lib/XML/Atom.pm line 52.
t/31-external-entities-xpath.t ... ok

Test Summary Report
-------------------
t/11-entry.t (Wstat: 1536 Tests: 71 Failed: 6)
Failed tests: 43, 48, 66-69
Non-zero exit status: 6
t/12-feed.t (Wstat: 65280 Tests: 29 Failed: 0)
Non-zero exit status: 255
Parse errors: Bad plan. You planned 33 tests but ran 29.
t/13-atom1.t (Wstat: 65280 Tests: 5 Failed: 4)
Failed tests: 2-5
Non-zero exit status: 255
Parse errors: Bad plan. You planned 23 tests but ran 5.
t/17-renames.t (Wstat: 65280 Tests: 1 Failed: 0)
Non-zero exit status: 255
Parse errors: Bad plan. You planned 5 tests but ran 1.
t/19-ext.t (Wstat: 512 Tests: 16 Failed: 2)
Failed tests: 12-13
Non-zero exit status: 2
t/23-category.t (Wstat: 65280 Tests: 1 Failed: 1)
Failed test: 1
Non-zero exit status: 255
t/25-utf8-create.t (Wstat: 256 Tests: 2 Failed: 1)
Failed test: 2
Non-zero exit status: 1
t/28-ext.t (Wstat: 1536 Tests: 8 Failed: 6)
Failed tests: 2-4, 6-8
Non-zero exit status: 6
t/29-source.t (Wstat: 65280 Tests: 1 Failed: 1)
Failed test: 1
Non-zero exit status: 255
Parse errors: Bad plan. You planned 9 tests but ran 1.
Files=24, Tests=216, 9 wallclock secs ( 0.09 usr + 0.08 sys = 0.17 CPU)
Result: FAIL
Failed 9/24 test programs. 21/216 subtests failed.
NMAKE : fatal error U1077: 'C:\Perl64\bin\perl.exe' : return code '0xff'
Stop.
MIYAGAWA/XML-Atom-0.41.tar.gz
3 dependencies missing (DateTime::TimeZone,DateTime,XML::LibXML); additionally t
est harness failed
C:\PROGRA~2\MIB055~1\VC98\bin\nmake.exe test -- NOT OK
//hint// to see the cpan-testers results for installing this module, try:
reports MIYAGAWA/XML-Atom-0.41.tar.gz
Running make install
make test had returned bad status, won't install without force
Running make for S/SE/SEKIMURA/AnyEvent-Gmail-Feed-0.02.tar.gz
Has already been unwrapped into directory C:\Perl64\cpan\build\AnyEvent-Gmail-
Feed-0.02-fG8HmD

CPAN.pm: Building S/SE/SEKIMURA/AnyEvent-Gmail-Feed-0.02.tar.gz

Warning: Prerequisite 'XML::Atom::Feed => 0' for 'S/SE/SEKIMURA/AnyEvent-Gmail-F
eed-0.02.tar.gz' seems not available according to the indices

Microsoft (R) Program Maintenance Utility Version 6.00.8168.0
Copyright (C) Microsoft Corp 1988-1998. All rights reserved.

cp lib/AnyEvent/Gmail/Feed.pm blib\lib\AnyEvent\Gmail\Feed.pm

2U2NAAu</content><link xmlns="http://purl.org/atom/ns#" xmlns:list="http://www.s
ixapart.com/atom/list#" title="Number Three" rel="service.post" href="http://www
.example.com/atom" type="application/x.atom+xml" list:type="Books" /><subject xm
lns:dc="http://purl.org/dc/elements/1.1/">Weblog</subject></entry>'
# doesn't match '(?^:<dc:subject .*>Weblog</dc:subject>)'

# Failed test at t/11-entry.t line 152.
# '<?xml version="1.0" encoding="UTF-8"?>
# <entry xmlns="http://purl.org/atom/ns#"><content xmlns="http://purl.org/atom/n
s#" mode="base64" type="image/gif">VGhpcyBpcyBhIHRlc3QgdGhhdCBzaG91bGQgdXNlIGJhc
2U2NAAu</content><link xmlns="http://purl.org/atom/ns#" xmlns:list="http://www.s
ixapart.com/atom/list#" title="Number Three" rel="service.post" href="http://www
.example.com/atom" type="application/x.atom+xml" list:type="Books" /><subject xm
lns:dc="http://purl.org/dc/elements/1.1/">Weblog</subject><subject xmlns:dc="htt
p://purl.org/dc/elements/1.1/">Tech</subject></entry>'
# doesn't match '(?^:<dc:subject .*>Weblog</dc:subject>)'

# Failed test at t/11-entry.t line 153.
# '<?xml version="1.0" encoding="UTF-8"?>
# <entry xmlns="http://purl.org/atom/ns#"><content xmlns="http://purl.org/atom/n
s#" mode="base64" type="image/gif">VGhpcyBpcyBhIHRlc3QgdGhhdCBzaG91bGQgdXNlIGJhc
2U2NAAu</content><link xmlns="http://purl.org/atom/ns#" xmlns:list="http://www.s
ixapart.com/atom/list#" title="Number Three" rel="service.post" href="http://www
.example.com/atom" type="application/x.atom+xml" list:type="Books" /><subject xm
lns:dc="http://purl.org/dc/elements/1.1/">Weblog</subject><subject xmlns:dc="htt
p://purl.org/dc/elements/1.1/">Tech</subject></entry>'
# doesn't match '(?^:<dc:subject .*>Tech</dc:subject>)'

# Failed test at t/11-entry.t line 157.
# '<?xml version="1.0" encoding="UTF-8"?>
# <entry xmlns="http://purl.org/atom/ns#"><content xmlns="http://purl.org/atom/n
s#" mode="base64" type="image/gif">VGhpcyBpcyBhIHRlc3QgdGhhdCBzaG91bGQgdXNlIGJhc
2U2NAAu</content><link xmlns="http://purl.org/atom/ns#" xmlns:list="http://www.s
ixapart.com/atom/list#" title="Number Three" rel="service.post" href="http://www
.example.com/atom" type="application/x.atom+xml" list:type="Books" /><subject xm
lns:dc="http://purl.org/dc/elements/1.1/">Weblog</subject><subject xmlns:dc="htt
p://purl.org/dc/elements/1.1/">Tech</subject><subject xmlns:dc="http://purl.org/
dc/elements/1.1/">Weblog</subject></entry>'
# doesn't match '(?^:<dc:subject .*>Weblog</dc:subject>)'
# Looks like you failed 6 tests of 71.
t/11-entry.t ..................... Dubious, test returned 6 (wstat 1536, 0x600)
Failed 6/71 subtests
(less 2 skipped subtests: 63 okay)
t/12-feed.t ...................... 1/33 Can't call method "get_global_pos" on an
undefined value at C:/Perl64/site/lib/XML/XPath/Node.pm line 412.
# Looks like you planned 33 tests but ran 29.
# Looks like your test exited with 255 just after 29.
t/12-feed.t ...................... Dubious, test returned 255 (wstat 65280, 0xff
00)
Failed 4/33 subtests
t/13-atom1.t ..................... 1/23
# Failed test 'atom:title'
# at t/13-atom1.t line 13.
# got: undef
# expected: 'dive into mark'

# Failed test 'atom:version based on namespace'
# at t/13-atom1.t line 14.
# got: '0.3'
# expected: '1.0'

# Failed test 'atom:updated'
# at t/13-atom1.t line 15.
# got: undef
# expected: '2005-07-11T12:29:29Z'

# Failed test '2 links'
# at t/13-atom1.t line 18.
# got: '0'
# expected: '2'
Can't call method "rel" on an undefined value at t/13-atom1.t line 53.
# Looks like you planned 23 tests but ran 5.
# Looks like you failed 4 tests of 5 run.
# Looks like your test exited with 255 just after 5.
t/13-atom1.t ..................... Dubious, test returned 255 (wstat 65280, 0xff
00)
Failed 22/23 subtests
t/14-atom1-create.t .............. ok
t/15-content-image.t ............. ok
t/16-content-binary.t ............ ok
t/17-renames.t ................... 1/5 Can't call method "modified" on an undefi
ned value at t/17-renames.t line 11.
# Looks like you planned 5 tests but ran 1.
# Looks like your test exited with 255 just after 1.
t/17-renames.t ................... Dubious, test returned 255 (wstat 65280, 0xff
00)
Failed 4/5 subtests
t/18-unicode.t ................... skipped: Skipping Unicode test since it depen
ds on LibXML
t/19-ext.t ....................... 1/16
# Failed test at t/19-ext.t line 35.
# '<?xml version="1.0" encoding="UTF-8"?>
# <with_ns xmlns="XML::Atom::Namespace=HASH(0x2ef5f08)" baz="1" />'
# doesn't match '(?^:<withns:with_ns.+xmlns:withns="http://example.com/withn
s/")'

# Failed test at t/19-ext.t line 38.
# '<?xml version="1.0" encoding="UTF-8"?>
# <feed xmlns="http://purl.org/atom/ns#"><foo xmlns="http://www.example.com/ns/"
><bar xmlns="http://www.example.com/ns/">1</bar></foo><foo2 xmlns="http://www.ex
ample.com/ns/"><bar xmlns="http://www.example.com/ns/">1</bar></foo2><with_ns xm
lns="XML::Atom::Namespace=HASH(0x2ef5f08)" baz="1" /></feed>'
# doesn't match '(?^:<withns:with_ns.+xmlns:withns="http://example.com/withn
s/")'
# Looks like you failed 2 tests of 16.
t/19-ext.t ....................... Dubious, test returned 2 (wstat 512, 0x200)
Failed 2/16 subtests
t/20-content-xhtml.t ............. ok
t/23-category.t ..................
t/23-category.t .................. 1/? # Failed test at t/23-category.t line 9
.
Can't call method "title" on an undefined value at t/23-category.t line 10.
# Looks like you failed 1 test of 1.
# Looks like your test exited with 255 just after 1.
t/23-category.t .................. Dubious, test returned 255 (wstat 65280, 0xff
00)
Failed 1/1 subtests
t/24-bad-content.t ............... ok
t/25-utf8-create.t ............... 1/?
# Failed test at t/25-utf8-create.t line 17.
# got: undef
# expected: 'Dicion&#9500;írios'
# Looks like you failed 1 test of 2.
t/25-utf8-create.t ............... Dubious, test returned 1 (wstat 256, 0x100)
Failed 1/2 subtests
t/27-client-leaks.t .............. skipped: DateTime is required for tests
t/28-ext.t ....................... 1/8
# Failed test 'extension accessors'
# at t/28-ext.t line 61.
# got: undef
# expected: '2'

# Failed test 'extension accessors'
# at t/28-ext.t line 61.
# got: undef
# expected: '2'

# Failed test 'extension accessors'
# at t/28-ext.t line 61.
# got: undef
# expected: '2'

# Failed test 'ext link match'
# at t/28-ext.t line 66.
# '<?xml version="1.0" encoding="UTF-8"?>
# <feed xmlns="http://purl.org/atom/ns#"><link xmlns="http://purl.org/atom/ns#"
href="http://www.legacy_link.com" /><link xmlns="XML::Atom::Namespace=HASH(0x2de
fc8)" href="http://www.extended_link.org" /><totalResults xmlns:testext="http://
test.com/-/spec/test/0.1/">2</totalResults><startIndex xmlns:testext="http://tes
t.com/-/spec/test/0.1/">2</startIndex><itemsPerPage xmlns:testext="http://test.c
om/-/spec/test/0.1/">2</itemsPerPage></feed>'
# doesn't match '(?^:<testext:link xmlns:testext="http://test.com/-/spec/tes
t/0.1/" href="http://www.extended_link.org"/>)'

# Failed test 'ext method match'
# at t/28-ext.t line 68.
# '<?xml version="1.0" encoding="UTF-8"?>
# <feed xmlns="http://purl.org/atom/ns#"><link xmlns="http://purl.org/atom/ns#"
href="http://www.legacy_link.com" /><link xmlns="XML::Atom::Namespace=HASH(0x2de
fc8)" href="http://www.extended_link.org" /><totalResults xmlns:testext="http://
test.com/-/spec/test/0.1/">2</totalResults><startIndex xmlns:testext="http://tes
t.com/-/spec/test/0.1/">2</startIndex><itemsPerPage xmlns:testext="http://test.c
om/-/spec/test/0.1/">2</itemsPerPage></feed>'
# doesn't match '(?^:<testext:startIndex xmlns:testext="http://test.com/-/sp
ec/test/0.1/">2</testext:startIndex>)'

# Failed test 'standard link match'
# at t/28-ext.t line 70.
# '<?xml version="1.0" encoding="UTF-8"?>
# <feed xmlns="http://purl.org/atom/ns#"><link xmlns="http://purl.org/atom/ns#"
href="http://www.legacy_link.com" /><link xmlns="XML::Atom::Namespace=HASH(0x2de
fc8)" href="http://www.extended_link.org" /><totalResults xmlns:testext="http://
test.com/-/spec/test/0.1/">2</totalResults><startIndex xmlns:testext="http://tes
t.com/-/spec/test/0.1/">2</startIndex><itemsPerPage xmlns:testext="http://test.c
om/-/spec/test/0.1/">2</itemsPerPage></feed>'
# doesn't match '(?^:<link(?: xmlns="http://purl.org/atom/ns#")? href="http:
//www.legacy_link.com"/>)'
# Looks like you failed 6 tests of 8.
t/28-ext.t ....................... Dubious, test returned 6 (wstat 1536, 0x600)
Failed 6/8 subtests
t/29-source.t ....................
t/29-source.t .................... 1/9 # Failed test at t/29-source.t line 9.
Can't call method "title" on an undefined value at t/29-source.t line 10.
# Looks like you planned 9 tests but ran 1.
# Looks like you failed 1 test of 1 run.
# Looks like your test exited with 255 just after 1.
t/29-source.t .................... Dubious, test returned 255 (wstat 65280, 0xff
00)
Failed 9/9 subtests
t/30-datetime-stringification.t .. skipped: DateTime and DateTime::Format::Atom
are required for tests
t/31-external-entities-libxml.t .. skipped: LibXML required for this test
t/31-external-entities-xpath.t ... External Entities disabled. at C:\Perl64\cpan
\build\XML-Atom-0.41-6j5ava\blib\lib/XML/Atom.pm line 52.
t/31-external-entities-xpath.t ... ok

Test Summary Report
-------------------
t/11-entry.t (Wstat: 1536 Tests: 71 Failed: 6)
Failed tests: 43, 48, 66-69
Non-zero exit status: 6
t/12-feed.t (Wstat: 65280 Tests: 29 Failed: 0)
Non-zero exit status: 255
Parse errors: Bad plan. You planned 33 tests but ran 29.
t/13-atom1.t (Wstat: 65280 Tests: 5 Failed: 4)
Failed tests: 2-5
Non-zero exit status: 255
Parse errors: Bad plan. You planned 23 tests but ran 5.
t/17-renames.t (Wstat: 65280 Tests: 1 Failed: 0)
Non-zero exit status: 255
Parse errors: Bad plan. You planned 5 tests but ran 1.
t/19-ext.t (Wstat: 512 Tests: 16 Failed: 2)
Failed tests: 12-13
Non-zero exit status: 2
t/23-category.t (Wstat: 65280 Tests: 1 Failed: 1)
Failed test: 1
Non-zero exit status: 255
t/25-utf8-create.t (Wstat: 256 Tests: 2 Failed: 1)
Failed test: 2
Non-zero exit status: 1
t/28-ext.t (Wstat: 1536 Tests: 8 Failed: 6)
Failed tests: 2-4, 6-8
Non-zero exit status: 6
t/29-source.t (Wstat: 65280 Tests: 1 Failed: 1)
Failed test: 1
Non-zero exit status: 255
Parse errors: Bad plan. You planned 9 tests but ran 1.
Files=24, Tests=216, 9 wallclock secs ( 0.09 usr + 0.08 sys = 0.17 CPU)
Result: FAIL
Failed 9/24 test programs. 21/216 subtests failed.
NMAKE : fatal error U1077: 'C:\Perl64\bin\perl.exe' : return code '0xff'
Stop.
MIYAGAWA/XML-Atom-0.41.tar.gz
3 dependencies missing (DateTime::TimeZone,DateTime,XML::LibXML); additionally t
est harness failed
C:\PROGRA~2\MIB055~1\VC98\bin\nmake.exe test -- NOT OK
//hint// to see the cpan-testers results for installing this module, try:
reports MIYAGAWA/XML-Atom-0.41.tar.gz
Running make install
make test had returned bad status, won't install without force
Running make for S/SE/SEKIMURA/AnyEvent-Gmail-Feed-0.02.tar.gz
Has already been unwrapped into directory C:\Perl64\cpan\build\AnyEvent-Gmail-
Feed-0.02-fG8HmD

CPAN.pm: Building S/SE/SEKIMURA/AnyEvent-Gmail-Feed-0.02.tar.gz

Warning: Prerequisite 'XML::Atom::Feed => 0' for 'S/SE/SEKIMURA/AnyEvent-Gmail-F
eed-0.02.tar.gz' seems not available according to the indices

Microsoft (R) Program Maintenance Utility Version 6.00.8168.0
Copyright (C) Microsoft Corp 1988-1998. All rights reserved.

cp lib/AnyEvent/Gmail/Feed.pm blib\lib\AnyEvent\Gmail\Feed.pm
SEKIMURA/AnyEvent-Gmail-Feed-0.02.tar.gz
C:\PROGRA~2\MIB055~1\VC98\bin\nmake.exe -- OK
Running make test

Microsoft (R) Program Maintenance Utility Version 6.00.8168.0
Copyright (C) Microsoft Corp 1988-1998. All rights reserved.

C:\Perl64\bin\perl.exe "-MExtUtils::Command::MM" "-e" "test_harness(0, '
inc', 'blib\lib', 'blib\arch')" t/*.t
t/00_compile.t ..
# Failed test 'use AnyEvent::Gmail::Feed;'
t/00_compile.t .. 1/1 # at t/00_compile.t line 4.
# Tried to use 'AnyEvent::Gmail::Feed'.
# Error: Can't locate XML/Atom/Feed.pm in @INC (@INC contains: C:\Perl64\cp
an\build\AnyEvent-Gmail-Feed-0.02-fG8HmD\inc C:\Perl64\cpan\build\AnyEvent-Gmail
-Feed-0.02-fG8HmD\blib\lib C:\Perl64\cpan\build\AnyEvent-Gmail-Feed-0.02-fG8HmD\
blib\arch C:/Perl64/site/lib C:/Perl64/lib .) at C:\Perl64\cpan\build\AnyEvent-G
mail-Feed-0.02-fG8HmD\blib\lib/AnyEvent/Gmail/Feed.pm line 10.
# BEGIN failed--compilation aborted at C:\Perl64\cpan\build\AnyEvent-Gmail-Feed-
0.02-fG8HmD\blib\lib/AnyEvent/Gmail/Feed.pm line 10.
# Compilation failed in require at (eval 2) line 2.
# BEGIN failed--compilation aborted at (eval 2) line 2.
# Looks like you failed 1 test of 1.
t/00_compile.t .. Dubious, test returned 1 (wstat 256, 0x100)
Failed 1/1 subtests

Test Summary Report
-------------------
t/00_compile.t (Wstat: 256 Tests: 1 Failed: 1)
Failed test: 1
Non-zero exit status: 1
Files=1, Tests=1, 0 wallclock secs ( 0.01 usr + 0.05 sys = 0.06 CPU)
Result: FAIL
Failed 1/1 test programs. 1/1 subtests failed.
NMAKE : fatal error U1077: 'C:\Perl64\bin\perl.exe' : return code '0x1'
Stop.
SEKIMURA/AnyEvent-Gmail-Feed-0.02.tar.gz
one dependency not OK (XML::Atom::Feed); additionally test harness failed
C:\PROGRA~2\MIB055~1\VC98\bin\nmake.exe test -- NOT OK
//hint// to see the cpan-testers results for installing this module, try:
reports SEKIMURA/AnyEvent-Gmail-Feed-0.02.tar.gz
Running make install
make test had returned bad status, won't install without force
Could not read metadata file. Falling back to other methods to determine prerequ
isites

C:\Apache\cgi-bin\dsd2014_74>


It didnot install. Please guide me.

Zulfi.


FishMonger
Veteran / Moderator

Nov 26, 2014, 9:06 AM

Post #21 of 44 (17683 views)
Re: [zak100] Automatic reply to email [In reply to] Can't Post

It's a very high probability that some of the installs are failing because they are not compatible with Windows 64 bit perl. Uninstall perl and install strawberry perl 5.20 32 bit.
http://strawberryperl.com/

Another option would be to switch to *nix system instead of Windows.


(This post was edited by FishMonger on Nov 26, 2014, 9:14 AM)


zak100
User

Nov 26, 2014, 10:09 AM

Post #22 of 44 (17662 views)
Re: [FishMonger] Automatic reply to email [In reply to] Can't Post

Hi,
Thanks for your guidance. In the lab we have unix but i cant install using cpan. At this point i cant switch to strawbery becasue i have asked every body to use Active State. May be in the next semester i would opt for strawbery. Thanks for your advice.

Zulfi.


FishMonger
Veteran / Moderator

Nov 26, 2014, 10:46 AM

Post #23 of 44 (17654 views)
Re: [zak100] Automatic reply to email [In reply to] Can't Post

You're teaching a perl course? Ouch, I'm not sure who I feel more sorry for, you or the students.


zak100
User

Nov 27, 2014, 5:38 AM

Post #24 of 44 (17484 views)
Re: [FishMonger] Automatic reply to email [In reply to] Can't Post

Hi,
I cant do any thing if the installation doesnt work. I have one last option to try google's built in notification. I dont know where is that guy who advised me to download the modules & then compile using make file.
Thanks for your concerns. I have even emailed the Active State Team. But they are very slow in replying.
Zulfi.


pstewart
Novice

Nov 27, 2014, 10:52 AM

Post #25 of 44 (17453 views)
Re: [FishMonger] Automatic reply to email [In reply to] Can't Post


In Reply To
You're teaching a perl course? Ouch, I'm not sure who I feel more sorry for, you or the students.

I doubt he's a teacher. Everything posted reads like he's a STUDENT who is trying to get an assignment done. The fact that he can't install anything on the machines in HIS OWN LAB would indicate he has no rights....which leads you to think he's a student.

That, plus the fact he's been trolling for stuff like this since 2009. Always the same MO, too:

"This is my code"....which has been verbatim copied from somewhere
"It isn't working because of xxxx"....error message that tells you how to fix it
"I'm a teacher"...who has no rights to the machine in his own environment, and somehow can't get anything INSTALLED on his own machines, even if that was true...and, apparently, he's teaching a course he has NO KNOWLEDGE of.

First page Previous page 1 2 Next page Last page  View All
 
 


Search for (options) Powered by Gossamer Forum v.1.2.0

Web Applications & Managed Hosting Powered by Gossamer Threads
Visit our Mailing List Archives